null
SMILES: N[C@H]1CCN(C1)C(=O)CN(CC(=O)NCc1cc(cc(c1)C(F)(F)F)C(F)(F)F)c1cccc(Oc2ccccc2)c1
InChI Key: InChIKey=KHPNQJDXEBEUDN-QFIPXVFZSA-N
Activity Spreadsheet -- Enzyme Inhibition Constant Data from BindingDB
Found 2 hits for monomerid = 111593
Trg + Lig
Ki
nM
ΔG°
kcal/mole
IC50
nM
Kd
nM
EC50/IC50
nM
koff
s-1
kon
M-1s-1
pHTemp
°C
1,3-beta-glucan synthase
(Neosartorya fumigata (Aspergillus fumigatus))
BDBM111593
(US8624022, OGT4165)
Show SMILES N[C@H]1CCN(C1)C(=O)CN(CC(=O)NCc1cc(cc(c1)C(F)(F)F)C(F)(F)F)c1cccc(Oc2ccccc2)c1 |r|
Show InChI InChI=1S/C29H28F6N4O3/c30-28(31,32)20-11-19(12-21(13-20)29(33,34)35)15-37-26(40)17-39(18-27(41)38-10-9-22(36)16-38)23-5-4-8-25(14-23)42-24-6-2-1-3-7-24/h1-8,11-14,22H,9-10,15-18,36H2,(H,37,40)/t22-/m0/s1
US Patent
n/an/a 6.20E+3n/an/an/an/a8.030
UCB Pharma, S.A.
US Patent
Assay Description
The glucan synthase assay follows the incorporation of tritiated UDP-glucose into acid insoluble β-glucan as catalysed by the glucan synthase ac...
US Patent US8624022 (2014)
BindingDB Entry DOI: 10.7270/Q2QF8RJX
1,3-beta-glucan synthase
(Candida albicans (Yeast))
BDBM111593
(US8624022, OGT4165)
Show SMILES N[C@H]1CCN(C1)C(=O)CN(CC(=O)NCc1cc(cc(c1)C(F)(F)F)C(F)(F)F)c1cccc(Oc2ccccc2)c1 |r|
Show InChI InChI=1S/C29H28F6N4O3/c30-28(31,32)20-11-19(12-21(13-20)29(33,34)35)15-37-26(40)17-39(18-27(41)38-10-9-22(36)16-38)23-5-4-8-25(14-23)42-24-6-2-1-3-7-24/h1-8,11-14,22H,9-10,15-18,36H2,(H,37,40)/t22-/m0/s1
US Patent
n/an/a 2.70E+3n/an/an/an/a8.030
UCB Pharma, S.A.
US Patent
Assay Description
The glucan synthase assay follows the incorporation of tritiated UDP-glucose into acid insoluble β-glucan as catalysed by the glucan synthase ac...
US Patent US8624022 (2014)
BindingDB Entry DOI: 10.7270/Q2QF8RJX