BDBM11161 (1R)-3-(5,6-dihydro[1,2,4]triazolo[4,3-a]pyrazin-7(8H)-yl)-3-oxo-1-(2,4,5-trifluorobenzyl)propylamine hydrochloride::(3R)-3-amino-1-{5H,6H,7H,8H-[1,2,4]triazolo[3,4-a]pyrazin-7-yl}-4-(2,4,5-trifluorophenyl)butan-1-one hydrochloride::CHEMBL479370::Triazolopiperazine Analogue 26
SMILES: N[C@@H](CC(=O)N1CCn2cnnc2C1)Cc1cc(F)c(F)cc1F
InChI Key: InChIKey=KJXVBDNOXKGFEH-SNVBAGLBSA-N
Data: 5 IC50
PDB links: 1 PDB ID contains this monomer as substructures. 1 PDB ID contains inhibitors having a similarity of 90% to this monomer.
Activity Spreadsheet -- Enzyme Inhibition Constant Data from BindingDB
Found 5 hits for monomerid = 11161
Trg + Lig
Ki
nM
ΔG°
kcal/mole
IC50
nM
Kd
nM
EC50/IC50
nM
koff
s-1
kon
M-1s-1
pHTemp
°C
Dipeptidyl peptidase 4
(Homo sapiens (Human))
BDBM11161
((1R)-3-(5,6-dihydro[1,2,4]triazolo[4,3-a]pyrazin-7...)
Show SMILES N[C@@H](CC(=O)N1CCn2cnnc2C1)Cc1cc(F)c(F)cc1F |r|
Show InChI InChI=1S/C15H16F3N5O/c16-11-6-13(18)12(17)4-9(11)3-10(19)5-15(24)22-1-2-23-8-20-21-14(23)7-22/h4,6,8,10H,1-3,5,7,19H2/t10-/m1/s1
Reactome pathway
n/an/a 68n/an/an/an/a7.537
Merck Research Laboratories
Assay Description
The enzyme activity resulted in the formation of the fluorescent product amidomethylcoumarin (AMC), which was monitored by excitation at 360 nm and m...
J Med Chem 48: 141-51 (2005)
Article DOI: 10.1021/jm0493156
BindingDB Entry DOI: 10.7270/Q2HH6H8H
Dipeptidyl peptidase VIII
(Homo sapiens (Human))
BDBM11161
((1R)-3-(5,6-dihydro[1,2,4]triazolo[4,3-a]pyrazin-7...)
Show SMILES N[C@@H](CC(=O)N1CCn2cnnc2C1)Cc1cc(F)c(F)cc1F |r|
Show InChI InChI=1S/C15H16F3N5O/c16-11-6-13(18)12(17)4-9(11)3-10(19)5-15(24)22-1-2-23-8-20-21-14(23)7-22/h4,6,8,10H,1-3,5,7,19H2/t10-/m1/s1
n/an/a 7.20E+4n/an/an/an/a7.537
Merck Research Laboratories
Assay Description
The enzyme activity resulted in the formation of the fluorescent product amidomethylcoumarin (AMC), which was monitored by excitation at 360 nm and m...
J Med Chem 48: 141-51 (2005)
Article DOI: 10.1021/jm0493156
BindingDB Entry DOI: 10.7270/Q2HH6H8H
Dipeptidyl peptidase 4
(Homo sapiens (Human))
BDBM11161
((1R)-3-(5,6-dihydro[1,2,4]triazolo[4,3-a]pyrazin-7...)
Show SMILES N[C@@H](CC(=O)N1CCn2cnnc2C1)Cc1cc(F)c(F)cc1F |r|
Show InChI InChI=1S/C15H16F3N5O/c16-11-6-13(18)12(17)4-9(11)3-10(19)5-15(24)22-1-2-23-8-20-21-14(23)7-22/h4,6,8,10H,1-3,5,7,19H2/t10-/m1/s1
Reactome pathway
n/an/a 68n/an/an/an/an/an/a
Merck Research Laboratories
Curated by ChEMBL
Assay Description
Inhibition of DPP4 (unknown origin)
J Med Chem 51: 4359-69 (2008)
Article DOI: 10.1021/jm800219f
BindingDB Entry DOI: 10.7270/Q28915N5
Dipeptidyl peptidase 2 (DPP II)
(Homo sapiens (Human))
BDBM11161
((1R)-3-(5,6-dihydro[1,2,4]triazolo[4,3-a]pyrazin-7...)
Show SMILES N[C@@H](CC(=O)N1CCn2cnnc2C1)Cc1cc(F)c(F)cc1F |r|
Show InChI InChI=1S/C15H16F3N5O/c16-11-6-13(18)12(17)4-9(11)3-10(19)5-15(24)22-1-2-23-8-20-21-14(23)7-22/h4,6,8,10H,1-3,5,7,19H2/t10-/m1/s1
n/an/a>1.00E+4n/an/an/an/an/an/a
Merck Research Laboratories
Assay Description
The enzyme activity resulted in the formation of the fluorescent product amidomethylcoumarin (AMC), which was monitored by excitation at 360 nm and m...
J Med Chem 48: 141-51 (2005)
Article DOI: 10.1021/jm0493156
BindingDB Entry DOI: 10.7270/Q2HH6H8H
Dipeptidyl peptidase 9
(Homo sapiens (Human))
BDBM11161
((1R)-3-(5,6-dihydro[1,2,4]triazolo[4,3-a]pyrazin-7...)
Show SMILES N[C@@H](CC(=O)N1CCn2cnnc2C1)Cc1cc(F)c(F)cc1F |r|
Show InChI InChI=1S/C15H16F3N5O/c16-11-6-13(18)12(17)4-9(11)3-10(19)5-15(24)22-1-2-23-8-20-21-14(23)7-22/h4,6,8,10H,1-3,5,7,19H2/t10-/m1/s1
n/an/a>1.00E+5n/an/an/an/a7.537
Merck Research Laboratories
Assay Description
The enzyme activity resulted in the formation of the fluorescent product amidomethylcoumarin (AMC), which was monitored by excitation at 360 nm and m...
J Med Chem 48: 141-51 (2005)
Article DOI: 10.1021/jm0493156
BindingDB Entry DOI: 10.7270/Q2HH6H8H