BDBM111895 US8623901, 222
SMILES: O=c1[nH]c(Cc2ccccc2-c2ccc(cc2)C#N)nc2n(ncc12)C1CCOCC1
InChI Key: InChIKey=JRTXAXVPJIXBMP-UHFFFAOYSA-N
Data: 1 IC50
Activity Spreadsheet -- Enzyme Inhibition Constant Data from BindingDB
Found 1 hit for monomerid = 111895
Trg + Lig
Ki
nM
ΔG°
kcal/mole
IC50
nM
Kd
nM
EC50/IC50
nM
koff
s-1
kon
M-1s-1
pHTemp
°C
Phosphodiesterase 9A
(Homo sapiens (Human))
BDBM111895
(US8623901, 222)
Show SMILES O=c1[nH]c(Cc2ccccc2-c2ccc(cc2)C#N)nc2n(ncc12)C1CCOCC1
Show InChI InChI=1S/C24H21N5O2/c25-14-16-5-7-17(8-6-16)20-4-2-1-3-18(20)13-22-27-23-21(24(30)28-22)15-26-29(23)19-9-11-31-12-10-19/h1-8,15,19H,9-13H2,(H,27,28,30)
US Patent
n/an/a 15n/an/an/an/a7.50
Boehringer Ingelheim International GmbH
US Patent
Assay Description
The PDE9A2 enzymatic activity assay was run as scintillation proximity assay (SPA), in general according to the protocol of the manufacturer (GE Heal...
US Patent US8623901 (2014)
BindingDB Entry DOI: 10.7270/Q2Z036TP