BDBM112460 US8623885, 1
SMILES: C[C@H]1CC[C@@H](CC1)n1c2cnccc2c2cnc(Nc3ccc4CNCCc4n3)nc12
InChI Key: InChIKey=OEJRGRXZSULSGO-JCNLHEQBSA-N
Data: 2 IC50
Activity Spreadsheet -- Enzyme Inhibition Constant Data from BindingDB
Found 2 hits for monomerid = 112460
Trg + Lig
Ki
nM
ΔG°
kcal/mole
IC50
nM
Kd
nM
EC50/IC50
nM
koff
s-1
kon
M-1s-1
pHTemp
°C
Cyclin-dependent kinase 4
(Homo sapiens (Human))
BDBM112460
(US8623885, 1)
Show SMILES C[C@H]1CC[C@@H](CC1)n1c2cnccc2c2cnc(Nc3ccc4CNCCc4n3)nc12 |r,wU:4.7,wD:1.0,(4.13,-4.37,;3.73,-2.88,;4.82,-1.79,;4.42,-.3,;2.93,.09,;1.84,-.99,;2.24,-2.48,;2.53,1.58,;3.44,2.83,;4.97,2.99,;5.6,4.4,;4.69,5.64,;3.16,5.48,;2.53,4.07,;1.07,3.6,;-.26,4.37,;-1.6,3.6,;-1.6,2.06,;-2.93,1.29,;-2.93,-.25,;-1.6,-1.02,;-1.6,-2.56,;-2.93,-3.33,;-2.93,-4.87,;-4.26,-5.64,;-5.6,-4.87,;-5.6,-3.33,;-4.26,-2.56,;-4.26,-1.02,;-.26,1.29,;1.07,2.06,)|
Show InChI InChI=1S/C24H27N7/c1-15-2-5-17(6-3-15)31-21-14-26-10-8-18(21)19-13-27-24(30-23(19)31)29-22-7-4-16-12-25-11-9-20(16)28-22/h4,7-8,10,13-15,17,25H,2-3,5-6,9,11-12H2,1H3,(H,27,28,29,30)/t15-,17-
NCI pathway
Reactome pathway
US Patent
n/an/a 2.10n/an/an/an/a7.4n/a
Amgen Inc.
US Patent
Assay Description
The CDK4 and CDK1 inhibitory activity of the CDK4/6-FLT3 inhibitors was determined with a filtration kinase assay. The compounds, kinase and substrat...
US Patent US8623885 (2014)
BindingDB Entry DOI: 10.7270/Q2DZ06Z1
Receptor-type tyrosine-protein kinase FLT3
(Homo sapiens (Human))
BDBM112460
(US8623885, 1)
Show SMILES C[C@H]1CC[C@@H](CC1)n1c2cnccc2c2cnc(Nc3ccc4CNCCc4n3)nc12 |r,wU:4.7,wD:1.0,(4.13,-4.37,;3.73,-2.88,;4.82,-1.79,;4.42,-.3,;2.93,.09,;1.84,-.99,;2.24,-2.48,;2.53,1.58,;3.44,2.83,;4.97,2.99,;5.6,4.4,;4.69,5.64,;3.16,5.48,;2.53,4.07,;1.07,3.6,;-.26,4.37,;-1.6,3.6,;-1.6,2.06,;-2.93,1.29,;-2.93,-.25,;-1.6,-1.02,;-1.6,-2.56,;-2.93,-3.33,;-2.93,-4.87,;-4.26,-5.64,;-5.6,-4.87,;-5.6,-3.33,;-4.26,-2.56,;-4.26,-1.02,;-.26,1.29,;1.07,2.06,)|
Show InChI InChI=1S/C24H27N7/c1-15-2-5-17(6-3-15)31-21-14-26-10-8-18(21)19-13-27-24(30-23(19)31)29-22-7-4-16-12-25-11-9-20(16)28-22/h4,7-8,10,13-15,17,25H,2-3,5-6,9,11-12H2,1H3,(H,27,28,29,30)/t15-,17-
US Patent
n/an/a 1.30n/an/an/an/a7.6n/a
Amgen Inc.
US Patent
Assay Description
The FLT3 inhibitory activity of the CDK4/6-FLT3 inhibitors was determined with a HTRF kinase assay. The FLT3 enzyme (GST-FLT3 fusion) was purchased f...
US Patent US8623885 (2014)
BindingDB Entry DOI: 10.7270/Q2DZ06Z1