BDBM112462 US8623885, 3
SMILES: C[C@H]1CC[C@@H](CC1)n1c2cnccc2c2cnc(Nc3ccc4CN(CCO)CCc4n3)nc12
InChI Key: InChIKey=PRIMAMTZCAWUCI-UAPYVXQJSA-N
Data: 2 IC50
Activity Spreadsheet -- Enzyme Inhibition Constant Data from BindingDB
Found 2 hits for monomerid = 112462
Trg + Lig
Ki
nM
ΔG°
kcal/mole
IC50
nM
Kd
nM
EC50/IC50
nM
koff
s-1
kon
M-1s-1
pHTemp
°C
Cyclin-dependent kinase 4
(Homo sapiens (Human))
BDBM112462
(US8623885, 3)
Show SMILES C[C@H]1CC[C@@H](CC1)n1c2cnccc2c2cnc(Nc3ccc4CN(CCO)CCc4n3)nc12 |r,wU:4.7,wD:1.0,(4.13,-3.21,;3.73,-1.73,;4.82,-.64,;4.42,.85,;2.93,1.25,;1.84,.16,;2.24,-1.33,;2.53,2.74,;3.44,3.98,;4.97,4.14,;5.6,5.55,;4.69,6.8,;3.16,6.64,;2.53,5.23,;1.07,4.75,;-.26,5.52,;-1.6,4.75,;-1.6,3.21,;-2.93,2.44,;-2.93,.9,;-1.6,.13,;-1.6,-1.41,;-2.93,-2.18,;-2.93,-3.72,;-4.26,-4.49,;-4.26,-6.03,;-2.93,-6.8,;-1.6,-6.03,;-5.6,-3.72,;-5.6,-2.18,;-4.26,-1.41,;-4.26,.13,;-.26,2.44,;1.07,3.21,)|
Show InChI InChI=1S/C26H31N7O/c1-17-2-5-19(6-3-17)33-23-15-27-10-8-20(23)21-14-28-26(31-25(21)33)30-24-7-4-18-16-32(12-13-34)11-9-22(18)29-24/h4,7-8,10,14-15,17,19,34H,2-3,5-6,9,11-13,16H2,1H3,(H,28,29,30,31)/t17-,19-
NCI pathway
Reactome pathway
US Patent
n/an/a 2.60n/an/an/an/a7.4n/a
Amgen Inc.
US Patent
Assay Description
The CDK4 and CDK1 inhibitory activity of the CDK4/6-FLT3 inhibitors was determined with a filtration kinase assay. The compounds, kinase and substrat...
US Patent US8623885 (2014)
BindingDB Entry DOI: 10.7270/Q2DZ06Z1
Receptor-type tyrosine-protein kinase FLT3
(Homo sapiens (Human))
BDBM112462
(US8623885, 3)
Show SMILES C[C@H]1CC[C@@H](CC1)n1c2cnccc2c2cnc(Nc3ccc4CN(CCO)CCc4n3)nc12 |r,wU:4.7,wD:1.0,(4.13,-3.21,;3.73,-1.73,;4.82,-.64,;4.42,.85,;2.93,1.25,;1.84,.16,;2.24,-1.33,;2.53,2.74,;3.44,3.98,;4.97,4.14,;5.6,5.55,;4.69,6.8,;3.16,6.64,;2.53,5.23,;1.07,4.75,;-.26,5.52,;-1.6,4.75,;-1.6,3.21,;-2.93,2.44,;-2.93,.9,;-1.6,.13,;-1.6,-1.41,;-2.93,-2.18,;-2.93,-3.72,;-4.26,-4.49,;-4.26,-6.03,;-2.93,-6.8,;-1.6,-6.03,;-5.6,-3.72,;-5.6,-2.18,;-4.26,-1.41,;-4.26,.13,;-.26,2.44,;1.07,3.21,)|
Show InChI InChI=1S/C26H31N7O/c1-17-2-5-19(6-3-17)33-23-15-27-10-8-20(23)21-14-28-26(31-25(21)33)30-24-7-4-18-16-32(12-13-34)11-9-22(18)29-24/h4,7-8,10,14-15,17,19,34H,2-3,5-6,9,11-13,16H2,1H3,(H,28,29,30,31)/t17-,19-
US Patent
n/an/a 1.80n/an/an/an/a7.6n/a
Amgen Inc.
US Patent
Assay Description
The FLT3 inhibitory activity of the CDK4/6-FLT3 inhibitors was determined with a HTRF kinase assay. The FLT3 enzyme (GST-FLT3 fusion) was purchased f...
US Patent US8623885 (2014)
BindingDB Entry DOI: 10.7270/Q2DZ06Z1