BDBM112472 US8623885, 13
SMILES: C[C@H]1CC[C@@H](CC1)n1c2cnccc2c2cnc(Nc3ccc4CNCC(C)c4n3)nc12
InChI Key: InChIKey=CMWZJGXVESUMJY-FKIWDRNQSA-N
Data: 2 IC50
Activity Spreadsheet -- Enzyme Inhibition Constant Data from BindingDB
Found 2 hits for monomerid = 112472
Trg + Lig
Ki
nM
ΔG°
kcal/mole
IC50
nM
Kd
nM
EC50/IC50
nM
koff
s-1
kon
M-1s-1
pHTemp
°C
Cyclin-dependent kinase 4
(Homo sapiens (Human))
BDBM112472
(US8623885, 13)
Show SMILES C[C@H]1CC[C@@H](CC1)n1c2cnccc2c2cnc(Nc3ccc4CNCC(C)c4n3)nc12 |r,w:26.28,wU:4.7,wD:1.0,(4.8,-4.37,;4.4,-2.88,;5.49,-1.79,;5.09,-.3,;3.6,.09,;2.51,-.99,;2.91,-2.48,;3.2,1.58,;4.11,2.83,;5.64,2.99,;6.26,4.4,;5.36,5.64,;3.83,5.48,;3.2,4.07,;1.74,3.6,;.4,4.37,;-.93,3.6,;-.93,2.06,;-2.26,1.29,;-2.26,-.25,;-.93,-1.02,;-.93,-2.56,;-2.26,-3.33,;-2.26,-4.87,;-3.6,-5.64,;-4.93,-4.87,;-4.93,-3.33,;-6.26,-2.56,;-3.6,-2.56,;-3.6,-1.02,;.4,1.29,;1.74,2.06,)|
Show InChI InChI=1S/C25H29N7/c1-15-3-6-18(7-4-15)32-21-14-26-10-9-19(21)20-13-28-25(31-24(20)32)30-22-8-5-17-12-27-11-16(2)23(17)29-22/h5,8-10,13-16,18,27H,3-4,6-7,11-12H2,1-2H3,(H,28,29,30,31)/t15-,16?,18-
NCI pathway
Reactome pathway
US Patent
n/an/a 31.3n/an/an/an/a7.4n/a
Amgen Inc.
US Patent
Assay Description
The CDK4 and CDK1 inhibitory activity of the CDK4/6-FLT3 inhibitors was determined with a filtration kinase assay. The compounds, kinase and substrat...
US Patent US8623885 (2014)
BindingDB Entry DOI: 10.7270/Q2DZ06Z1
Receptor-type tyrosine-protein kinase FLT3
(Homo sapiens (Human))
BDBM112472
(US8623885, 13)
Show SMILES C[C@H]1CC[C@@H](CC1)n1c2cnccc2c2cnc(Nc3ccc4CNCC(C)c4n3)nc12 |r,w:26.28,wU:4.7,wD:1.0,(4.8,-4.37,;4.4,-2.88,;5.49,-1.79,;5.09,-.3,;3.6,.09,;2.51,-.99,;2.91,-2.48,;3.2,1.58,;4.11,2.83,;5.64,2.99,;6.26,4.4,;5.36,5.64,;3.83,5.48,;3.2,4.07,;1.74,3.6,;.4,4.37,;-.93,3.6,;-.93,2.06,;-2.26,1.29,;-2.26,-.25,;-.93,-1.02,;-.93,-2.56,;-2.26,-3.33,;-2.26,-4.87,;-3.6,-5.64,;-4.93,-4.87,;-4.93,-3.33,;-6.26,-2.56,;-3.6,-2.56,;-3.6,-1.02,;.4,1.29,;1.74,2.06,)|
Show InChI InChI=1S/C25H29N7/c1-15-3-6-18(7-4-15)32-21-14-26-10-9-19(21)20-13-28-25(31-24(20)32)30-22-8-5-17-12-27-11-16(2)23(17)29-22/h5,8-10,13-16,18,27H,3-4,6-7,11-12H2,1-2H3,(H,28,29,30,31)/t15-,16?,18-
US Patent
n/an/a 1.80n/an/an/an/a7.6n/a
Amgen Inc.
US Patent
Assay Description
The FLT3 inhibitory activity of the CDK4/6-FLT3 inhibitors was determined with a HTRF kinase assay. The FLT3 enzyme (GST-FLT3 fusion) was purchased f...
US Patent US8623885 (2014)
BindingDB Entry DOI: 10.7270/Q2DZ06Z1