BDBM112509 US8618103, I-5
SMILES: CS(=O)(=O)N1CC[C@H](C1)Nc1ncccc1-c1cnc2[nH]ccc2n1
InChI Key: InChIKey=NONQHXZJSJTQSM-LLVKDONJSA-N
Data: 1 KI  2 IC50
Activity Spreadsheet -- Enzyme Inhibition Constant Data from BindingDB
Found 2 hits for monomerid = 112509
Trg + Lig
Ki
nM
ΔG°
kcal/mole
IC50
nM
Kd
nM
EC50/IC50
nM
koff
s-1
kon
M-1s-1
pHTemp
°C
Tyrosine-protein kinase JAK3
(Homo sapiens (Human))
BDBM112509
(US8618103, I-5)
Show SMILES CS(=O)(=O)N1CC[C@H](C1)Nc1ncccc1-c1cnc2[nH]ccc2n1 |r|
Show InChI InChI=1S/C16H18N6O2S/c1-25(23,24)22-8-5-11(10-22)20-15-12(3-2-6-17-15)14-9-19-16-13(21-14)4-7-18-16/h2-4,6-7,9,11H,5,8,10H2,1H3,(H,17,20)(H,18,19)/t11-/m1/s1
Reactome pathway
US Patent
0.00537n/a 0.0105n/an/an/an/a7.2n/a
Hoffmann-La Roche Inc.
US Patent
Assay Description
The kinase activity of all three JAK kinases is measured using a radioactive, end-point assay and with trace amounts of 33P-ATP.
US Patent US8618103 (2013)
BindingDB Entry DOI: 10.7270/Q25H7DZH
Tyrosine-protein kinase JAK2
(Homo sapiens (Human))
BDBM112509
(US8618103, I-5)
Show SMILES CS(=O)(=O)N1CC[C@H](C1)Nc1ncccc1-c1cnc2[nH]ccc2n1 |r|
Show InChI InChI=1S/C16H18N6O2S/c1-25(23,24)22-8-5-11(10-22)20-15-12(3-2-6-17-15)14-9-19-16-13(21-14)4-7-18-16/h2-4,6-7,9,11H,5,8,10H2,1H3,(H,17,20)(H,18,19)/t11-/m1/s1
Reactome pathway
US Patent
n/an/a 0.0296n/an/an/an/a7.2n/a
Hoffmann-La Roche Inc.
US Patent
Assay Description
The kinase activity of all three JAK kinases is measured using a radioactive, end-point assay and with trace amounts of 33P-ATP.
US Patent US8618103 (2013)
BindingDB Entry DOI: 10.7270/Q25H7DZH