BDBM11256 AG7088 analogue 4b::ethyl (2E,4S)-4-[(2S)-2-[(2S)-2-{[(benzyloxy)carbonyl]amino}-3-methylbutanamido]-3-(4-fluorophenyl)propanamido]-5-phenylpent-2-enoate
SMILES: CCOC(=O)\C=C\[C@H](Cc1ccccc1)NC(=O)[C@H](Cc1ccc(F)cc1)NC(=O)[C@@H](NC(=O)OCc1ccccc1)C(C)C
InChI Key: InChIKey=VFODSYFBKHPECI-LFILEMNHSA-N
Data: 1 IC50
Activity Spreadsheet -- Enzyme Inhibition Constant Data from BindingDB
Found 1 hit for monomerid = 11256
Trg + Lig
Ki
nM
ΔG°
kcal/mole
IC50
nM
Kd
nM
EC50/IC50
nM
koff
s-1
kon
M-1s-1
pHTemp
°C
3C-like proteinase (3CL-PRO)
(Human SARS coronavirus (SARS-CoV) (Severe acute re...)
BDBM11256
(AG7088 analogue 4b | ethyl (2E,4S)-4-[(2S)-2-[(2S)...)
Show SMILES CCOC(=O)\C=C\[C@H](Cc1ccccc1)NC(=O)[C@H](Cc1ccc(F)cc1)NC(=O)[C@@H](NC(=O)OCc1ccccc1)C(C)C |r|
Show InChI InChI=1S/C35H40FN3O6/c1-4-44-31(40)20-19-29(21-25-11-7-5-8-12-25)37-33(41)30(22-26-15-17-28(36)18-16-26)38-34(42)32(24(2)3)39-35(43)45-23-27-13-9-6-10-14-27/h5-20,24,29-30,32H,4,21-23H2,1-3H3,(H,37,41)(H,38,42)(H,39,43)/b20-19+/t29-,30+,32+/m1/s1
n/an/a 1.10E+4n/an/an/an/a7.025
National Taiwan University
Assay Description
The effects of compound on enzyme activity were measured by using a fluorogenic peptide cleavage assay. Enhanced fluorescence caused by cleavage of t...
Bioorg Med Chem 13: 5240-52 (2005)
Article DOI: 10.1016/j.bmc.2005.05.065
BindingDB Entry DOI: 10.7270/Q2VT1Q9R