BDBM112574 US8618103, I-70
SMILES: CC(C)CS(=O)(=O)N1CCC[C@@H](C1)Nc1nc(N)ncc1-c1cnc2[nH]ccc2n1
InChI Key: InChIKey=OKNGBMISBWKGAC-ZDUSSCGKSA-N
Data: 1 KI  2 IC50
Activity Spreadsheet -- Enzyme Inhibition Constant Data from BindingDB
Found 2 hits for monomerid = 112574
Trg + Lig
Ki
nM
ΔG°
kcal/mole
IC50
nM
Kd
nM
EC50/IC50
nM
koff
s-1
kon
M-1s-1
pHTemp
°C
Tyrosine-protein kinase JAK3
(Homo sapiens (Human))
BDBM112574
(US8618103, I-70)
Show SMILES CC(C)CS(=O)(=O)N1CCC[C@@H](C1)Nc1nc(N)ncc1-c1cnc2[nH]ccc2n1 |r|
Show InChI InChI=1S/C19H26N8O2S/c1-12(2)11-30(28,29)27-7-3-4-13(10-27)24-17-14(8-23-19(20)26-17)16-9-22-18-15(25-16)5-6-21-18/h5-6,8-9,12-13H,3-4,7,10-11H2,1-2H3,(H,21,22)(H3,20,23,24,26)/t13-/m0/s1
Reactome pathway
US Patent
0.000578n/a 0.00115n/an/an/an/a7.2n/a
Hoffmann-La Roche Inc.
US Patent
Assay Description
The kinase activity of all three JAK kinases is measured using a radioactive, end-point assay and with trace amounts of 33P-ATP.
US Patent US8618103 (2013)
BindingDB Entry DOI: 10.7270/Q25H7DZH
Tyrosine-protein kinase JAK2
(Homo sapiens (Human))
BDBM112574
(US8618103, I-70)
Show SMILES CC(C)CS(=O)(=O)N1CCC[C@@H](C1)Nc1nc(N)ncc1-c1cnc2[nH]ccc2n1 |r|
Show InChI InChI=1S/C19H26N8O2S/c1-12(2)11-30(28,29)27-7-3-4-13(10-27)24-17-14(8-23-19(20)26-17)16-9-22-18-15(25-16)5-6-21-18/h5-6,8-9,12-13H,3-4,7,10-11H2,1-2H3,(H,21,22)(H3,20,23,24,26)/t13-/m0/s1
Reactome pathway
US Patent
n/an/a 0.0196n/an/an/an/a7.2n/a
Hoffmann-La Roche Inc.
US Patent
Assay Description
The kinase activity of all three JAK kinases is measured using a radioactive, end-point assay and with trace amounts of 33P-ATP.
US Patent US8618103 (2013)
BindingDB Entry DOI: 10.7270/Q25H7DZH