BDBM112587 US8618103, I-83
SMILES: CS(=O)(=O)N1CCC[C@@H](C1)Nc1[nH]c(=O)ncc1-c1cnc2[nH]ccc2n1
InChI Key: InChIKey=HPYIEWCWRQCQOL-JTQLQIEISA-N
Data: 1 KI  2 IC50
Activity Spreadsheet -- Enzyme Inhibition Constant Data from BindingDB
Found 2 hits for monomerid = 112587
Trg + Lig
Ki
nM
ΔG°
kcal/mole
IC50
nM
Kd
nM
EC50/IC50
nM
koff
s-1
kon
M-1s-1
pHTemp
°C
Tyrosine-protein kinase JAK3
(Homo sapiens (Human))
BDBM112587
(US8618103, I-83)
Show SMILES CS(=O)(=O)N1CCC[C@@H](C1)Nc1[nH]c(=O)ncc1-c1cnc2[nH]ccc2n1 |r|
Show InChI InChI=1S/C16H19N7O3S/c1-27(25,26)23-6-2-3-10(9-23)20-14-11(7-19-16(24)22-14)13-8-18-15-12(21-13)4-5-17-15/h4-5,7-8,10H,2-3,6,9H2,1H3,(H,17,18)(H2,19,20,22,24)/t10-/m0/s1
Reactome pathway
US Patent
0.00860n/a 0.0172n/an/an/an/a7.2n/a
Hoffmann-La Roche Inc.
US Patent
Assay Description
The kinase activity of all three JAK kinases is measured using a radioactive, end-point assay and with trace amounts of 33P-ATP.
US Patent US8618103 (2013)
BindingDB Entry DOI: 10.7270/Q25H7DZH
Tyrosine-protein kinase JAK2
(Homo sapiens (Human))
BDBM112587
(US8618103, I-83)
Show SMILES CS(=O)(=O)N1CCC[C@@H](C1)Nc1[nH]c(=O)ncc1-c1cnc2[nH]ccc2n1 |r|
Show InChI InChI=1S/C16H19N7O3S/c1-27(25,26)23-6-2-3-10(9-23)20-14-11(7-19-16(24)22-14)13-8-18-15-12(21-13)4-5-17-15/h4-5,7-8,10H,2-3,6,9H2,1H3,(H,17,18)(H2,19,20,22,24)/t10-/m0/s1
Reactome pathway
US Patent
n/an/a 0.129n/an/an/an/a7.2n/a
Hoffmann-La Roche Inc.
US Patent
Assay Description
The kinase activity of all three JAK kinases is measured using a radioactive, end-point assay and with trace amounts of 33P-ATP.
US Patent US8618103 (2013)
BindingDB Entry DOI: 10.7270/Q25H7DZH