null
SMILES: COc1cc(CC=C(c2cc(O)c(OC)cc2O)c2c(OC)cc3OC(CCc3c2O)c2ccc(O)c(O)c2)ccc1O
InChI Key: InChIKey=HDNOPEYAKHYHCG-UHFFFAOYSA-N
Activity Spreadsheet -- Enzyme Inhibition Constant Data from BindingDB
Found 4 hits for monomerid = 112635
Trg + Lig
Ki
nM
ΔG°
kcal/mole
IC50
nM
Kd
nM
EC50/IC50
nM
koff
s-1
kon
M-1s-1
pHTemp
°C
Dopa decarboxylase (Aromatic L-amino acid decarboxylase), isoform CRA_a
(Homo sapiens (Human))
BDBM112635
((−)-Euonyquinone C (8) | (+)-Euonyquinone C ...)
Show SMILES COc1cc(CC=C(c2cc(O)c(OC)cc2O)c2c(OC)cc3OC(CCc3c2O)c2ccc(O)c(O)c2)ccc1O |w:6.5|
Show InChI InChI=1S/C33H32O10/c1-40-29-12-17(5-9-23(29)35)4-7-19(21-14-26(38)30(41-2)15-24(21)36)32-31(42-3)16-28-20(33(32)39)8-11-27(43-28)18-6-10-22(34)25(37)13-18/h5-7,9-10,12-16,27,34-39H,4,8,11H2,1-3H3
n/an/a 1.00E+5n/an/an/an/a8.0537
Shanghai Center for Systems Biomedicine, School of Pharmacy, and State Key Laboratory of Microbial Metabolism & School of Life Sciences and Biotechnology
Assay Description
To the wells of a 384-well polypropylene plate, 1 µL DMSO (control) or test compounds at indicated concentrations were added, followed by the ad...
ACS Chem Biol 9: 897-903 (2014)
Article DOI: 10.1021/cb500009r
BindingDB Entry DOI: 10.7270/Q2S75F0F
Cystathionine gamma-lyase
(Homo sapiens (Human))
BDBM112635
((−)-Euonyquinone C (8) | (+)-Euonyquinone C ...)
Show SMILES COc1cc(CC=C(c2cc(O)c(OC)cc2O)c2c(OC)cc3OC(CCc3c2O)c2ccc(O)c(O)c2)ccc1O |w:6.5|
Show InChI InChI=1S/C33H32O10/c1-40-29-12-17(5-9-23(29)35)4-7-19(21-14-26(38)30(41-2)15-24(21)36)32-31(42-3)16-28-20(33(32)39)8-11-27(43-28)18-6-10-22(34)25(37)13-18/h5-7,9-10,12-16,27,34-39H,4,8,11H2,1-3H3
Reactome pathway
n/an/a>2.00E+5n/an/an/an/a7.037
Shanghai Center for Systems Biomedicine, School of Pharmacy, and State Key Laboratory of Microbial Metabolism & School of Life Sciences and Biotechnology
Assay Description
500 nM hCSE in optimal buffer (50 mM Hepes, pH 7.0; final concentration) was incubated with compound for 45 min in the 192-tandem-well plate before a...
ACS Chem Biol 9: 897-903 (2014)
Article DOI: 10.1021/cb500009r
BindingDB Entry DOI: 10.7270/Q2S75F0F
Cystathionine gamma-lyase
(Homo sapiens (Human))
BDBM112635
((−)-Euonyquinone C (8) | (+)-Euonyquinone C ...)
Show SMILES COc1cc(CC=C(c2cc(O)c(OC)cc2O)c2c(OC)cc3OC(CCc3c2O)c2ccc(O)c(O)c2)ccc1O |w:6.5|
Show InChI InChI=1S/C33H32O10/c1-40-29-12-17(5-9-23(29)35)4-7-19(21-14-26(38)30(41-2)15-24(21)36)32-31(42-3)16-28-20(33(32)39)8-11-27(43-28)18-6-10-22(34)25(37)13-18/h5-7,9-10,12-16,27,34-39H,4,8,11H2,1-3H3
Reactome pathway
n/an/a>2.00E+5n/an/an/an/a7.037
Shanghai Center for Systems Biomedicine, School of Pharmacy, and State Key Laboratory of Microbial Metabolism & School of Life Sciences and Biotechnology
Assay Description
500 nM hCSE in optimal buffer (50 mM Hepes, pH 7.0; final concentration) was incubated with compound for 45 min in the 192-tandem-well plate before a...
ACS Chem Biol 9: 897-903 (2014)
Article DOI: 10.1021/cb500009r
BindingDB Entry DOI: 10.7270/Q2S75F0F
Dopa decarboxylase (Aromatic L-amino acid decarboxylase), isoform CRA_a
(Homo sapiens (Human))
BDBM112635
((−)-Euonyquinone C (8) | (+)-Euonyquinone C ...)
Show SMILES COc1cc(CC=C(c2cc(O)c(OC)cc2O)c2c(OC)cc3OC(CCc3c2O)c2ccc(O)c(O)c2)ccc1O |w:6.5|
Show InChI InChI=1S/C33H32O10/c1-40-29-12-17(5-9-23(29)35)4-7-19(21-14-26(38)30(41-2)15-24(21)36)32-31(42-3)16-28-20(33(32)39)8-11-27(43-28)18-6-10-22(34)25(37)13-18/h5-7,9-10,12-16,27,34-39H,4,8,11H2,1-3H3
n/an/a 1.00E+5n/an/an/an/a8.0537
Shanghai Center for Systems Biomedicine, School of Pharmacy, and State Key Laboratory of Microbial Metabolism & School of Life Sciences and Biotechnology
Assay Description
To the wells of a 384-well polypropylene plate, 1 µL DMSO (control) or test compounds at indicated concentrations were added, followed by the ad...
ACS Chem Biol 9: 897-903 (2014)
Article DOI: 10.1021/cb500009r
BindingDB Entry DOI: 10.7270/Q2S75F0F