BDBM112641 (2R)-3′,4′-Dihydroxy-5,7-methoxyflavan (14)
SMILES: COc1cc(OC)c2CC[C@@H](Oc2c1)c1ccc(O)c(O)c1
InChI Key: InChIKey=OQHDHVCMAOKOKY-OAHLLOKOSA-N
Data: 2 IC50
Activity Spreadsheet -- Enzyme Inhibition Constant Data from BindingDB
Found 2 hits for monomerid = 112641
Trg + Lig
Ki
nM
ΔG°
kcal/mole
IC50
nM
Kd
nM
EC50/IC50
nM
koff
s-1
kon
M-1s-1
pHTemp
°C
Cystathionine gamma-lyase
(Homo sapiens (Human))
BDBM112641
((2R)-3′,4′-Dihydroxy-5,7-methoxyflavan...)
Show SMILES COc1cc(OC)c2CC[C@@H](Oc2c1)c1ccc(O)c(O)c1 |r|
Show InChI InChI=1S/C17H18O5/c1-20-11-8-16(21-2)12-4-6-15(22-17(12)9-11)10-3-5-13(18)14(19)7-10/h3,5,7-9,15,18-19H,4,6H2,1-2H3/t15-/m1/s1
Reactome pathway
n/an/a>2.00E+5n/an/an/an/a7.037
Shanghai Center for Systems Biomedicine, School of Pharmacy, and State Key Laboratory of Microbial Metabolism & School of Life Sciences and Biotechnology
Assay Description
500 nM hCSE in optimal buffer (50 mM Hepes, pH 7.0; final concentration) was incubated with compound for 45 min in the 192-tandem-well plate before a...
ACS Chem Biol 9: 897-903 (2014)
Article DOI: 10.1021/cb500009r
BindingDB Entry DOI: 10.7270/Q2S75F0F
DOPA decarboxylase (DDC)
(Homo sapiens (Human))
BDBM112641
((2R)-3′,4′-Dihydroxy-5,7-methoxyflavan...)
Show SMILES COc1cc(OC)c2CC[C@@H](Oc2c1)c1ccc(O)c(O)c1 |r|
Show InChI InChI=1S/C17H18O5/c1-20-11-8-16(21-2)12-4-6-15(22-17(12)9-11)10-3-5-13(18)14(19)7-10/h3,5,7-9,15,18-19H,4,6H2,1-2H3/t15-/m1/s1
n/an/a>2.00E+5n/an/an/an/a8.0537
Shanghai Center for Systems Biomedicine, School of Pharmacy, and State Key Laboratory of Microbial Metabolism & School of Life Sciences and Biotechnology
Assay Description
To the wells of a 384-well polypropylene plate, 1 µL DMSO (control) or test compounds at indicated concentrations were added, followed by the ad...
ACS Chem Biol 9: 897-903 (2014)
Article DOI: 10.1021/cb500009r
BindingDB Entry DOI: 10.7270/Q2S75F0F