BDBM112768 US8629141, 38
SMILES: CC(=O)N1CC(C1)NC(=O)[C@@H]1NC2(CCCCC2)[C@]2([C@H]1c1cccc(Cl)c1F)C(=O)Nc1cc(Cl)ccc21
InChI Key: InChIKey=SDCCOKXGHZANMZ-ZQIDGUAPSA-N
Data: 1 KI  2 IC50
Activity Spreadsheet -- Enzyme Inhibition Constant Data from BindingDB
Found 3 hits for monomerid = 112768
Trg + Lig
Ki
nM
ΔG°
kcal/mole
IC50
nM
Kd
nM
EC50/IC50
nM
koff
s-1
kon
M-1s-1
pHTemp
°C
E3 ubiquitin-protein ligase Mdm2
(Homo sapiens (Human))
BDBM112768
(US8629141, 38)
Show SMILES CC(=O)N1CC(C1)NC(=O)[C@@H]1NC2(CCCCC2)[C@]2([C@H]1c1cccc(Cl)c1F)C(=O)Nc1cc(Cl)ccc21 |r|
Show InChI InChI=1S/C28H29Cl2FN4O3/c1-15(36)35-13-17(14-35)32-25(37)24-22(18-6-5-7-20(30)23(18)31)28(27(34-24)10-3-2-4-11-27)19-9-8-16(29)12-21(19)33-26(28)38/h5-9,12,17,22,24,34H,2-4,10-11,13-14H2,1H3,(H,32,37)(H,33,38)/t22-,24+,28+/m0/s1
NCI pathway
Reactome pathway
3.40n/an/an/an/an/an/an/an/a
University of Michigan Comprehensive Cancer Center
Curated by ChEMBL
Assay Description
Inhibition of FAM-tagged p53-based PMDM6-F peptide binding to human recombinant His-tagged MDM2 (1 to 118 residues) after 30 mins by fluorescence pol...
J Med Chem 60: 2819-2839 (2017)
Article DOI: 10.1021/acs.jmedchem.6b01665
BindingDB Entry DOI: 10.7270/Q25Q4ZCF
MDM2-MDMX
(Homo sapiens (Human))
BDBM112768
(US8629141, 38)
Show SMILES CC(=O)N1CC(C1)NC(=O)[C@@H]1NC2(CCCCC2)[C@]2([C@H]1c1cccc(Cl)c1F)C(=O)Nc1cc(Cl)ccc21 |r|
Show InChI InChI=1S/C28H29Cl2FN4O3/c1-15(36)35-13-17(14-35)32-25(37)24-22(18-6-5-7-20(30)23(18)31)28(27(34-24)10-3-2-4-11-27)19-9-8-16(29)12-21(19)33-26(28)38/h5-9,12,17,22,24,34H,2-4,10-11,13-14H2,1H3,(H,32,37)(H,33,38)/t22-,24+,28+/m0/s1
NCI pathway
Reactome pathway
n/an/a 17n/an/an/an/an/an/a
University of Michigan Comprehensive Cancer Center
Curated by ChEMBL
Assay Description
Inhibition of FAM-tagged p53-based PMDM6-F peptide binding to human recombinant His-tagged MDM2 (1 to 118 residues) after 30 mins by fluorescence pol...
J Med Chem 60: 2819-2839 (2017)
Article DOI: 10.1021/acs.jmedchem.6b01665
BindingDB Entry DOI: 10.7270/Q25Q4ZCF
E3 ubiquitin-protein ligase Mdm2
(Homo sapiens (Human))
BDBM112768
(US8629141, 38)
Show SMILES CC(=O)N1CC(C1)NC(=O)[C@@H]1NC2(CCCCC2)[C@]2([C@H]1c1cccc(Cl)c1F)C(=O)Nc1cc(Cl)ccc21 |r|
Show InChI InChI=1S/C28H29Cl2FN4O3/c1-15(36)35-13-17(14-35)32-25(37)24-22(18-6-5-7-20(30)23(18)31)28(27(34-24)10-3-2-4-11-27)19-9-8-16(29)12-21(19)33-26(28)38/h5-9,12,17,22,24,34H,2-4,10-11,13-14H2,1H3,(H,32,37)(H,33,38)/t22-,24+,28+/m0/s1
NCI pathway
Reactome pathway
US Patent
n/an/a<100n/an/an/an/an/an/a
The Regents of the University of Michigan; Sanofi
US Patent
Assay Description
The binding affinity of the MDM2 inhibitors disclosed herein was determined using a fluorescence polarization-based (FP-based) binding assay using a ...
US Patent US8629141 (2014)
BindingDB Entry DOI: 10.7270/Q2W094KC