BDBM113210 US8633206, 129
SMILES: C[C@@H]1C[C@@H](CS(=O)(=O)N2CCC[C@@H](O)C2)CC[C@@H]1N(C)c1ncnc2[nH]ccc12
InChI Key: InChIKey=RRWIERVKMPBTBE-HPFXQQBRSA-N
Data: 3 IC50
Activity Spreadsheet -- Enzyme Inhibition Constant Data from BindingDB
Found 3 hits for monomerid = 113210
Trg + Lig
Ki
nM
ΔG°
kcal/mole
IC50
nM
Kd
nM
EC50/IC50
nM
koff
s-1
kon
M-1s-1
pHTemp
°C
Tyrosine-protein kinase JAK1
(Homo sapiens (Human))
BDBM113210
(US8633206, 129)
Show SMILES C[C@@H]1C[C@@H](CS(=O)(=O)N2CCC[C@@H](O)C2)CC[C@@H]1N(C)c1ncnc2[nH]ccc12 |r|
Show InChI InChI=1S/C20H31N5O3S/c1-14-10-15(12-29(27,28)25-9-3-4-16(26)11-25)5-6-18(14)24(2)20-17-7-8-21-19(17)22-13-23-20/h7-8,13-16,18,26H,3-6,9-12H2,1-2H3,(H,21,22,23)/t14-,15+,16-,18+/m1/s1
Reactome pathway
US Patent
n/an/a 1.70n/an/an/an/a7.4n/a
Pfizer Inc.
US Patent
Assay Description
A peptide mobility shift assay was used to quantify the phosphorylation of the JAKtide (JAK2 and JAK3) or the IRS-1 peptide (JAK1 and Tyk2). Reaction...
US Patent US8633206 (2014)
BindingDB Entry DOI: 10.7270/Q2ZS2V44
Tyrosine-protein kinase JAK2
(Homo sapiens (Human))
BDBM113210
(US8633206, 129)
Show SMILES C[C@@H]1C[C@@H](CS(=O)(=O)N2CCC[C@@H](O)C2)CC[C@@H]1N(C)c1ncnc2[nH]ccc12 |r|
Show InChI InChI=1S/C20H31N5O3S/c1-14-10-15(12-29(27,28)25-9-3-4-16(26)11-25)5-6-18(14)24(2)20-17-7-8-21-19(17)22-13-23-20/h7-8,13-16,18,26H,3-6,9-12H2,1-2H3,(H,21,22,23)/t14-,15+,16-,18+/m1/s1
Reactome pathway
US Patent
n/an/a 6.89n/an/an/an/a7.4n/a
Pfizer Inc.
US Patent
Assay Description
A peptide mobility shift assay was used to quantify the phosphorylation of the JAKtide (JAK2 and JAK3) or the IRS-1 peptide (JAK1 and Tyk2). Reaction...
US Patent US8633206 (2014)
BindingDB Entry DOI: 10.7270/Q2ZS2V44
Tyrosine-protein kinase JAK3
(Homo sapiens (Human))
BDBM113210
(US8633206, 129)
Show SMILES C[C@@H]1C[C@@H](CS(=O)(=O)N2CCC[C@@H](O)C2)CC[C@@H]1N(C)c1ncnc2[nH]ccc12 |r|
Show InChI InChI=1S/C20H31N5O3S/c1-14-10-15(12-29(27,28)25-9-3-4-16(26)11-25)5-6-18(14)24(2)20-17-7-8-21-19(17)22-13-23-20/h7-8,13-16,18,26H,3-6,9-12H2,1-2H3,(H,21,22,23)/t14-,15+,16-,18+/m1/s1
Reactome pathway
US Patent
n/an/a 19.4n/an/an/an/a7.4n/a
Pfizer Inc.
US Patent
Assay Description
A peptide mobility shift assay was used to quantify the phosphorylation of the JAKtide (JAK2 and JAK3) or the IRS-1 peptide (JAK1 and Tyk2). Reaction...
US Patent US8633206 (2014)
BindingDB Entry DOI: 10.7270/Q2ZS2V44