BDBM113223 US8633212, 1
SMILES:
InChI Key: InChIKey=VIMGJCVRUVNFFH-UHFFFAOYSA-N
Data: 1 IC50
Activity Spreadsheet -- Enzyme Inhibition Constant Data from BindingDB
Found 1 hit for monomerid = 113223
Trg + Lig
Ki
nM
ΔG°
kcal/mole
IC50
nM
Kd
nM
EC50/IC50
nM
koff
s-1
kon
M-1s-1
pHTemp
°C
Beta-secretase 1 (BACE)
(Homo sapiens (Human))
BDBM113223
(US8633212, 1)
Show InChI InChI=1S/C23H25ClFN3O2/c1-28-21(26)27-23(30-28)20-11-14(16-9-17(24)12-18(25)10-16)3-4-15(20)13-22(23)7-5-19(29-2)6-8-22/h3-4,9-12,19H,5-8,13H2,1-2H3,(H2,26,27)
US Patent
n/an/a 2.60n/an/an/an/a4.525
Vitae Pharmaceuticals, Inc.; Boehringer Ingelheim International GmbH
US Patent
Assay Description
Inhibitory activity of compounds was assessed by a fluorescence quench assay of BACE activity. The assay was performed at room temperature in 96-well...
US Patent US8633212 (2014)
BindingDB Entry DOI: 10.7270/Q2V123D3