BDBM113735 (4-Phenylbutyl)hydrazine dihydrochloride salt (9h)
SMILES: NNCCCCc1ccccc1
InChI Key: InChIKey=RMZBTNCACRJLHK-UHFFFAOYSA-N
Data: 1 KI
Activity Spreadsheet -- Enzyme Inhibition Constant Data from BindingDB
Found 1 hit for monomerid = 113735
Trg + Lig
Ki
nM
ΔG°
kcal/mole
IC50
nM
Kd
nM
EC50/IC50
nM
koff
s-1
kon
M-1s-1
pHTemp
°C
Lysine-specific histone demethylase 1A
(Homo sapiens (Human))
BDBM113735
((4-Phenylbutyl)hydrazine dihydrochloride salt (9h))
Show SMILES NNCCCCc1ccccc1
Show InChI InChI=1S/C10H16N2/c11-12-9-5-4-8-10-6-2-1-3-7-10/h1-3,6-7,12H,4-5,8-9,11H2
Reactome pathway
2.20E+4n/an/an/an/an/an/a7.5n/a
Johns Hopkins University School of Medicine , Baltimore, Maryland 21205, United States
Assay Description
Reactions (100 µL) were initiated by the addition of 2 µL of GST-LSD1 (final concentration 96-154 nM). The reaction mixture contained 50 mM...
ACS Chem Biol 9: 1284-93 (2014)
Article DOI: 10.1021/cb500018s
BindingDB Entry DOI: 10.7270/Q2FN14VF