BDBM113750 (2E)-N-[4-(2-Hydrazinylethyl)phenyl]-3-phenylprop-2-enamide sulfate salt (13)
SMILES: NNCCc1ccc(NC(=O)\C=C\c2ccccc2)cc1
InChI Key: InChIKey=LDURLEVNPHSLED-DHZHZOJOSA-N
Data: 1 KI
Activity Spreadsheet -- Enzyme Inhibition Constant Data from BindingDB
Found 1 hit for monomerid = 113750
Trg + Lig
Ki
nM
ΔG°
kcal/mole
IC50
nM
Kd
nM
EC50/IC50
nM
koff
s-1
kon
M-1s-1
pHTemp
°C
Lysine-specific histone demethylase 1A
(Homo sapiens (Human))
BDBM113750
((2E)-N-[4-(2-Hydrazinylethyl)phenyl]-3-phenylprop-...)
Show SMILES NNCCc1ccc(NC(=O)\C=C\c2ccccc2)cc1
Show InChI InChI=1S/C17H19N3O/c18-19-13-12-15-6-9-16(10-7-15)20-17(21)11-8-14-4-2-1-3-5-14/h1-11,19H,12-13,18H2,(H,20,21)/b11-8+
Reactome pathway
100n/an/an/an/an/an/a7.5n/a
Johns Hopkins University School of Medicine , Baltimore, Maryland 21205, United States
Assay Description
Reactions (100 µL) were initiated by the addition of 2 µL of GST-LSD1 (final concentration 96-154 nM). The reaction mixture contained 50 mM...
ACS Chem Biol 9: 1284-93 (2014)
Article DOI: 10.1021/cb500018s
BindingDB Entry DOI: 10.7270/Q2FN14VF