BDBM113752 N-[4-(2-Hydrazinylethyl)phenyl]-3-(1H-indol-3-yl)propanamide sulfate salt (15a)
SMILES: NNCCc1ccc(NC(=O)CCc2c[nH]c3ccccc23)cc1
InChI Key: InChIKey=QXVLHKVUKPFJAL-UHFFFAOYSA-N
Data: 1 KI
Activity Spreadsheet -- Enzyme Inhibition Constant Data from BindingDB
Found 1 hit for monomerid = 113752
Trg + Lig
Ki
nM
ΔG°
kcal/mole
IC50
nM
Kd
nM
EC50/IC50
nM
koff
s-1
kon
M-1s-1
pHTemp
°C
Lysine-specific histone demethylase 1A
(Homo sapiens (Human))
BDBM113752
(N-[4-(2-Hydrazinylethyl)phenyl]-3-(1H-indol-3-yl)p...)
Show SMILES NNCCc1ccc(NC(=O)CCc2c[nH]c3ccccc23)cc1
Show InChI InChI=1S/C19H22N4O/c20-22-12-11-14-5-8-16(9-6-14)23-19(24)10-7-15-13-21-18-4-2-1-3-17(15)18/h1-6,8-9,13,21-22H,7,10-12,20H2,(H,23,24)
Reactome pathway
210n/an/an/an/an/an/a7.5n/a
Johns Hopkins University School of Medicine , Baltimore, Maryland 21205, United States
Assay Description
Reactions (100 µL) were initiated by the addition of 2 µL of GST-LSD1 (final concentration 96-154 nM). The reaction mixture contained 50 mM...
ACS Chem Biol 9: 1284-93 (2014)
Article DOI: 10.1021/cb500018s
BindingDB Entry DOI: 10.7270/Q2FN14VF