null
SMILES: CCOC(=O)CSc1nc(nc2ccccc12)-c1ccccc1
InChI Key: InChIKey=LDEHPRNCJJXOFE-UHFFFAOYSA-N
Activity Spreadsheet -- Enzyme Inhibition Constant Data from BindingDB
Found 1 hit for monomerid = 114330
Trg + Lig
Ki
nM
ΔG°
kcal/mole
IC50
nM
Kd
nM
EC50/IC50
nM
koff
s-1
kon
M-1s-1
pHTemp
°C
Major prion protein
(Homo sapiens (Human))
BDBM114330
((2-Phenyl-quinazolin-4-ylsulfanyl)-acetic acid eth...)
Show SMILES CCOC(=O)CSc1nc(nc2ccccc12)-c1ccccc1
Show InChI InChI=1S/C18H16N2O2S/c1-2-22-16(21)12-23-18-14-10-6-7-11-15(14)19-17(20-18)13-8-4-3-5-9-13/h3-11H,2,12H2,1H3
NCI pathway
Reactome pathway
PCBioAssay
n/an/a 1.73E+3n/an/an/an/an/an/a
The Scripps Research Institute Molecular Screening Center
Curated by PubChem BioAssay
Assay Description
Source (MLPCN Center Name): The Scripps Research Institute Molecular Screening Center (SRIMSC) Affiliation: The Scripps Research Institute, TSRI Assa...
PubChem Bioassay (2014)
BindingDB Entry DOI: 10.7270/Q2HM573M