null
SMILES: CCc1cc2c(occ(-c3ccc4OCOc4c3)c2=O)c(CN(C)C)c1O
InChI Key: InChIKey=GYQXMQJFFWCMNS-UHFFFAOYSA-N
Activity Spreadsheet -- Enzyme Inhibition Constant Data from BindingDB
Found 1 hit for monomerid = 114416
Trg + Lig
Ki
nM
ΔG°
kcal/mole
IC50
nM
Kd
nM
EC50/IC50
nM
koff
s-1
kon
M-1s-1
pHTemp
°C
Major prion protein
(Homo sapiens (Human))
BDBM114416
(3-(1,3-benzodioxol-5-yl)-8-[(dimethylamino)methyl]...)
Show SMILES CCc1cc2c(occ(-c3ccc4OCOc4c3)c2=O)c(CN(C)C)c1O
Show InChI InChI=1S/C21H21NO5/c1-4-12-7-14-20(24)16(13-5-6-17-18(8-13)27-11-26-17)10-25-21(14)15(19(12)23)9-22(2)3/h5-8,10,23H,4,9,11H2,1-3H3
NCI pathway
Reactome pathway
PCBioAssay
n/an/a 2.07E+3n/an/an/an/an/an/a
The Scripps Research Institute Molecular Screening Center
Curated by PubChem BioAssay
Assay Description
Source (MLPCN Center Name): The Scripps Research Institute Molecular Screening Center (SRIMSC) Affiliation: The Scripps Research Institute, TSRI Assa...
PubChem Bioassay (2014)
BindingDB Entry DOI: 10.7270/Q2HM573M