BDBM11460 2,6,9-trisubstituted adenine derivative::2-N-(4-aminocyclohexyl)-6-N-benzyl-9-cyclopentyl-9H-purine-2,6-diamine::2-[TRANS-(4-AMINOCYCLOHEXYL)AMINO]-6-(BENZYL-AMINO)-9-CYCLOPENTYLPURINE::H717
SMILES: N[C@H]1CC[C@@H](CC1)Nc1nc(NCc2ccccc2)c2ncn(C3CCCC3)c2n1
InChI Key: InChIKey=JTVILUUAQWQWBK-IYARVYRRSA-N
Data: 4 IC50
PDB links: 1 PDB ID matches this monomer.
Activity Spreadsheet -- Enzyme Inhibition Constant Data from BindingDB
Found 4 hits for monomerid = 11460
Trg + Lig
Ki
nM
ΔG°
kcal/mole
IC50
nM
Kd
nM
EC50/IC50
nM
koff
s-1
kon
M-1s-1
pHTemp
°C
Cyclin-dependent kinase 1
(Homo sapiens (Human))
BDBM11460
(2,6,9-trisubstituted adenine derivative | 2-N-(4-a...)
Show SMILES N[C@H]1CC[C@@H](CC1)Nc1nc(NCc2ccccc2)c2ncn(C3CCCC3)c2n1 |r,wU:1.0,wD:4.7,(-9.23,3.64,;-7.88,2.91,;-6.57,3.72,;-5.21,2.99,;-5.17,1.45,;-6.48,.64,;-7.83,1.37,;-3.83,.68,;-2.5,1.45,;-2.5,2.99,;-1.17,3.76,;-1.17,5.3,;.17,6.07,;.17,7.61,;-1.17,8.38,;-1.17,9.92,;.17,10.69,;1.5,9.92,;1.5,8.38,;.17,2.99,;1.63,3.46,;2.54,2.22,;1.63,.97,;2.11,-.49,;1.2,-1.74,;2.11,-2.99,;3.57,-2.51,;3.57,-.97,;.17,1.45,;-1.17,.68,)|
Show InChI InChI=1S/C23H31N7/c24-17-10-12-18(13-11-17)27-23-28-21(25-14-16-6-2-1-3-7-16)20-22(29-23)30(15-26-20)19-8-4-5-9-19/h1-3,6-7,15,17-19H,4-5,8-14,24H2,(H2,25,27,28,29)/t17-,18-
Reactome pathway
n/an/a 52n/an/an/an/an/an/a
Palack£ University
Curated by ChEMBL
Assay Description
Inhibition of human recombinant CDK1
J Med Chem 56: 6234-47 (2013)
Article DOI: 10.1021/jm4006884
BindingDB Entry DOI: 10.7270/Q2FX7BVZ
Cyclin-Dependent Kinase 1 (CDK1)
(Homo sapiens (Human))
BDBM11460
(2,6,9-trisubstituted adenine derivative | 2-N-(4-a...)
Show SMILES N[C@H]1CC[C@@H](CC1)Nc1nc(NCc2ccccc2)c2ncn(C3CCCC3)c2n1 |r,wU:1.0,wD:4.7,(-9.23,3.64,;-7.88,2.91,;-6.57,3.72,;-5.21,2.99,;-5.17,1.45,;-6.48,.64,;-7.83,1.37,;-3.83,.68,;-2.5,1.45,;-2.5,2.99,;-1.17,3.76,;-1.17,5.3,;.17,6.07,;.17,7.61,;-1.17,8.38,;-1.17,9.92,;.17,10.69,;1.5,9.92,;1.5,8.38,;.17,2.99,;1.63,3.46,;2.54,2.22,;1.63,.97,;2.11,-.49,;1.2,-1.74,;2.11,-2.99,;3.57,-2.51,;3.57,-.97,;.17,1.45,;-1.17,.68,)|
Show InChI InChI=1S/C23H31N7/c24-17-10-12-18(13-11-17)27-23-28-21(25-14-16-6-2-1-3-7-16)20-22(29-23)30(15-26-20)19-8-4-5-9-19/h1-3,6-7,15,17-19H,4-5,8-14,24H2,(H2,25,27,28,29)/t17-,18-
Reactome pathway
n/an/a 52n/an/an/an/a8.030
Lawrence Berkeley National Laboratory
Assay Description
The biochemical activity of compounds was determined by incubation with specific enzyme and substrate in the presence 0.5 uM ATP/ [gamma-33P] ATP. Af...
J Med Chem 44: 524-30 (2001)
Article DOI: 10.1021/jm001043t
BindingDB Entry DOI: 10.7270/Q2Q23XGD
Cyclin-Dependent Kinase 4 (CDK4)
(Homo sapiens (Human))
BDBM11460
(2,6,9-trisubstituted adenine derivative | 2-N-(4-a...)
Show SMILES N[C@H]1CC[C@@H](CC1)Nc1nc(NCc2ccccc2)c2ncn(C3CCCC3)c2n1 |r,wU:1.0,wD:4.7,(-9.23,3.64,;-7.88,2.91,;-6.57,3.72,;-5.21,2.99,;-5.17,1.45,;-6.48,.64,;-7.83,1.37,;-3.83,.68,;-2.5,1.45,;-2.5,2.99,;-1.17,3.76,;-1.17,5.3,;.17,6.07,;.17,7.61,;-1.17,8.38,;-1.17,9.92,;.17,10.69,;1.5,9.92,;1.5,8.38,;.17,2.99,;1.63,3.46,;2.54,2.22,;1.63,.97,;2.11,-.49,;1.2,-1.74,;2.11,-2.99,;3.57,-2.51,;3.57,-.97,;.17,1.45,;-1.17,.68,)|
Show InChI InChI=1S/C23H31N7/c24-17-10-12-18(13-11-17)27-23-28-21(25-14-16-6-2-1-3-7-16)20-22(29-23)30(15-26-20)19-8-4-5-9-19/h1-3,6-7,15,17-19H,4-5,8-14,24H2,(H2,25,27,28,29)/t17-,18-
NCI pathway
Reactome pathway
n/an/a 3.60E+3n/an/an/an/a7.530
Lawrence Berkeley National Laboratory
Assay Description
The enzyme was assayed with substrate GST-Rb in the presence of 10 uM ATP/[gamma-33P] ATP, and capturing the 33-P labeled reaction products on GSH-Se...
J Med Chem 44: 524-30 (2001)
Article DOI: 10.1021/jm001043t
BindingDB Entry DOI: 10.7270/Q2Q23XGD
CDK2/CycE
(Homo sapiens (Human))
BDBM11460
(2,6,9-trisubstituted adenine derivative | 2-N-(4-a...)
Show SMILES N[C@H]1CC[C@@H](CC1)Nc1nc(NCc2ccccc2)c2ncn(C3CCCC3)c2n1 |r,wU:1.0,wD:4.7,(-9.23,3.64,;-7.88,2.91,;-6.57,3.72,;-5.21,2.99,;-5.17,1.45,;-6.48,.64,;-7.83,1.37,;-3.83,.68,;-2.5,1.45,;-2.5,2.99,;-1.17,3.76,;-1.17,5.3,;.17,6.07,;.17,7.61,;-1.17,8.38,;-1.17,9.92,;.17,10.69,;1.5,9.92,;1.5,8.38,;.17,2.99,;1.63,3.46,;2.54,2.22,;1.63,.97,;2.11,-.49,;1.2,-1.74,;2.11,-2.99,;3.57,-2.51,;3.57,-.97,;.17,1.45,;-1.17,.68,)|
Show InChI InChI=1S/C23H31N7/c24-17-10-12-18(13-11-17)27-23-28-21(25-14-16-6-2-1-3-7-16)20-22(29-23)30(15-26-20)19-8-4-5-9-19/h1-3,6-7,15,17-19H,4-5,8-14,24H2,(H2,25,27,28,29)/t17-,18-
n/an/a 48n/an/an/an/a7.530
Lawrence Berkeley National Laboratory
Assay Description
The enzyme was assayed with substrate GST-Rb in the presence of 10 uM ATP/[gamma-33P] ATP, and capturing the 33-P labeled reaction products on GSH-Se...
J Med Chem 44: 524-30 (2001)
Article DOI: 10.1021/jm001043t
BindingDB Entry DOI: 10.7270/Q2Q23XGD
3D
3D Structure (crystal)