BDBM11493 (2S,3S)-3-[4-(2-fluorophenyl)phenyl]-1-[(3S)-3-fluoropyrrolidin-1-yl]-1-oxobutan-2-aminium; 2,2,2-trifluoroacetate::3-(S)-fluoropyrrolidide 13
SMILES: C[C@H]([C@H]([NH3+])C(=O)N1CC[C@H](F)C1)c1ccc(cc1)-c1ccccc1F
InChI Key: InChIKey=GSLWNMHQPRMTSK-AXHNFQJDSA-O
Data: 4 IC50
Activity Spreadsheet -- Enzyme Inhibition Constant Data from BindingDB
Found 4 hits for monomerid = 11493
Trg + Lig
Ki
nM
ΔG°
kcal/mole
IC50
nM
Kd
nM
EC50/IC50
nM
koff
s-1
kon
M-1s-1
pHTemp
°C
Dipeptidyl peptidase 4
(Homo sapiens (Human))
BDBM11493
((2S,3S)-3-[4-(2-fluorophenyl)phenyl]-1-[(3S)-3-flu...)
Show SMILES C[C@H]([C@H]([NH3+])C(=O)N1CC[C@H](F)C1)c1ccc(cc1)-c1ccccc1F |r|
Show InChI InChI=1S/C20H22F2N2O/c1-13(19(23)20(25)24-11-10-16(21)12-24)14-6-8-15(9-7-14)17-4-2-3-5-18(17)22/h2-9,13,16,19H,10-12,23H2,1H3/p+1/t13-,16-,19-/m0/s1
Reactome pathway
n/an/a 100n/an/an/an/an/an/a
Merck Research Laboratories
Assay Description
The enzyme activity resulted in the formation of the fluorescent product amidomethylcoumarin (AMC), which was monitored by excitation at 360 nm and m...
Bioorg Med Chem Lett 15: 2533-6 (2005)
Article DOI: 10.1016/j.bmcl.2005.03.055
BindingDB Entry DOI: 10.7270/Q2K935SH
Dipeptidyl peptidase 9
(Homo sapiens (Human))
BDBM11493
((2S,3S)-3-[4-(2-fluorophenyl)phenyl]-1-[(3S)-3-flu...)
Show SMILES C[C@H]([C@H]([NH3+])C(=O)N1CC[C@H](F)C1)c1ccc(cc1)-c1ccccc1F |r|
Show InChI InChI=1S/C20H22F2N2O/c1-13(19(23)20(25)24-11-10-16(21)12-24)14-6-8-15(9-7-14)17-4-2-3-5-18(17)22/h2-9,13,16,19H,10-12,23H2,1H3/p+1/t13-,16-,19-/m0/s1
n/an/a>1.00E+5n/an/an/an/an/an/a
Merck Research Laboratories
Assay Description
The enzyme activity resulted in the formation of the fluorescent product amidomethylcoumarin (AMC), which was monitored by excitation at 360 nm and m...
Bioorg Med Chem Lett 15: 2533-6 (2005)
Article DOI: 10.1016/j.bmcl.2005.03.055
BindingDB Entry DOI: 10.7270/Q2K935SH
Dipeptidyl peptidase VIII
(Homo sapiens (Human))
BDBM11493
((2S,3S)-3-[4-(2-fluorophenyl)phenyl]-1-[(3S)-3-flu...)
Show SMILES C[C@H]([C@H]([NH3+])C(=O)N1CC[C@H](F)C1)c1ccc(cc1)-c1ccccc1F |r|
Show InChI InChI=1S/C20H22F2N2O/c1-13(19(23)20(25)24-11-10-16(21)12-24)14-6-8-15(9-7-14)17-4-2-3-5-18(17)22/h2-9,13,16,19H,10-12,23H2,1H3/p+1/t13-,16-,19-/m0/s1
n/an/a>1.00E+5n/an/an/an/an/an/a
Merck Research Laboratories
Assay Description
The enzyme activity resulted in the formation of the fluorescent product amidomethylcoumarin (AMC), which was monitored by excitation at 360 nm and m...
Bioorg Med Chem Lett 15: 2533-6 (2005)
Article DOI: 10.1016/j.bmcl.2005.03.055
BindingDB Entry DOI: 10.7270/Q2K935SH
Dipeptidyl peptidase 2 (DPP II)
(Homo sapiens (Human))
BDBM11493
((2S,3S)-3-[4-(2-fluorophenyl)phenyl]-1-[(3S)-3-flu...)
Show SMILES C[C@H]([C@H]([NH3+])C(=O)N1CC[C@H](F)C1)c1ccc(cc1)-c1ccccc1F |r|
Show InChI InChI=1S/C20H22F2N2O/c1-13(19(23)20(25)24-11-10-16(21)12-24)14-6-8-15(9-7-14)17-4-2-3-5-18(17)22/h2-9,13,16,19H,10-12,23H2,1H3/p+1/t13-,16-,19-/m0/s1
n/an/a 1.10E+3n/an/an/an/an/an/a
Merck Research Laboratories
Assay Description
The enzyme activity resulted in the formation of the fluorescent product amidomethylcoumarin (AMC), which was monitored by excitation at 360 nm and m...
Bioorg Med Chem Lett 15: 2533-6 (2005)
Article DOI: 10.1016/j.bmcl.2005.03.055
BindingDB Entry DOI: 10.7270/Q2K935SH