BDBM115179 Monastrol::ethyl 4-(3-hydroxyphenyl)-6-methyl-2-sulfanylidene-3,4-dihydro-1H-pyrimidine-5-carboxylate
SMILES: CCOC(=O)C1C(NC(=S)N=C1C)c1cccc(O)c1
InChI Key: InChIKey=PSKVISJISBFCKP-UHFFFAOYSA-N
Data: 1 IC50
Activity Spreadsheet -- Enzyme Inhibition Constant Data from BindingDB
Found 1 hit for monomerid = 115179
Trg + Lig
Ki
nM
ΔG°
kcal/mole
IC50
nM
Kd
nM
EC50/IC50
nM
koff
s-1
kon
M-1s-1
pHTemp
°C
Kinesin-5 motor protein (KSP)
(Homo sapiens (Human))
BDBM115179
(Monastrol | ethyl 4-(3-hydroxyphenyl)-6-methyl-2-s...)
Show SMILES CCOC(=O)C1C(NC(=S)N=C1C)c1cccc(O)c1 |c:10|
Show InChI InChI=1S/C14H16N2O3S/c1-3-19-13(18)11-8(2)15-14(20)16-12(11)9-5-4-6-10(17)7-9/h4-7,11-12,17H,3H2,1-2H3,(H,16,20)
Reactome pathway
n/an/a 6.90E+3n/an/an/an/an/an/a
University of Santiago de Compostela, Jenaro de la Fuente s/n, Campus Vida, Santiago de Compostela 15782 (Spain)
Assay Description
The IC50 measurements were done using a microtubule-activated ATPase kinetic assay according to the manufacturer's instructions. Reactions were ...
Chembiochem 15: 1471-80 (2014)
Article DOI: 10.1002/cbic.201402089
BindingDB Entry DOI: 10.7270/Q29W0D5K