BDBM116504 US8637532, 185
SMILES: CN(C)CC(Nc1ncnc2c(cccc12)C(N)=O)c1ccc(cc1)C(F)(F)F
InChI Key: InChIKey=ZJDZJPZEQDNRHD-UHFFFAOYSA-N
Data: 2 IC50
Activity Spreadsheet -- Enzyme Inhibition Constant Data from BindingDB
Found 2 hits for monomerid = 116504
Trg + Lig
Ki
nM
ΔG°
kcal/mole
IC50
nM
Kd
nM
EC50/IC50
nM
koff
s-1
kon
M-1s-1
pHTemp
°C
Aurora kinase A
(Homo sapiens (Human))
BDBM116504
(US8637532, 185)
Show SMILES CN(C)CC(Nc1ncnc2c(cccc12)C(N)=O)c1ccc(cc1)C(F)(F)F
Show InChI InChI=1S/C20H20F3N5O/c1-28(2)10-16(12-6-8-13(9-7-12)20(21,22)23)27-19-15-5-3-4-14(18(24)29)17(15)25-11-26-19/h3-9,11,16H,10H2,1-2H3,(H2,24,29)(H,25,26,27)
NCI pathway
Reactome pathway
US Patent
n/an/a 1.00E+3n/an/an/an/an/an/a
Merck Patent GmbH
US Patent
Assay Description
The Aurora assays described here are performed on two Caliper Life Sciences systems: the LC3000 and the Desktop Profiler. These provide data on enzym...
US Patent US8637532 (2014)
BindingDB Entry DOI: 10.7270/Q21G0JZX
Ribosomal protein S6 kinase (P70S6K)
(Homo sapiens (Human))
BDBM116504
(US8637532, 185)
Show SMILES CN(C)CC(Nc1ncnc2c(cccc12)C(N)=O)c1ccc(cc1)C(F)(F)F
Show InChI InChI=1S/C20H20F3N5O/c1-28(2)10-16(12-6-8-13(9-7-12)20(21,22)23)27-19-15-5-3-4-14(18(24)29)17(15)25-11-26-19/h3-9,11,16H,10H2,1-2H3,(H2,24,29)(H,25,26,27)
NCI pathway
Reactome pathway
US Patent
n/an/a 0.140n/an/an/an/a7.525
Merck Patent GmbH
US Patent
Assay Description
P70S6K inhibitor compounds are diluted and plated in 96 well plates. A reaction mixture including the following components is then added to the compo...
US Patent US8637532 (2014)
BindingDB Entry DOI: 10.7270/Q21G0JZX