BDBM11698 (2S)-1-(2-{[3-(6,7-dimethoxy-1,2,3,4-tetrahydroisoquinolin-2-yl)-3-oxopropyl]amino}acetyl)pyrrolidine-2-carbonitrile::(2S)-Cyanopyrrolidine analogue 18b::2-[3-[2-[2-Cyano-(S)-pyrrolidin-1-yl]-2-oxoethylamino]-1-oxo-propyl]-6,7-dimethoxy-1,2,3,4-tetrahydroisoquinoline
SMILES: COc1cc2CCN(Cc2cc1OC)C(=O)CCNCC(=O)N1CCC[C@H]1C#N
InChI Key: InChIKey=XDQQWXJAAYYRMM-KRWDZBQOSA-N
Data: 3 IC50
Activity Spreadsheet -- Enzyme Inhibition Constant Data from BindingDB
Found 3 hits for monomerid = 11698
Trg + Lig
Ki
nM
ΔG°
kcal/mole
IC50
nM
Kd
nM
EC50/IC50
nM
koff
s-1
kon
M-1s-1
pHTemp
°C
Dipeptidyl peptidase 4
(Homo sapiens (Human))
BDBM11698
((2S)-1-(2-{[3-(6,7-dimethoxy-1,2,3,4-tetrahydroiso...)
Show SMILES COc1cc2CCN(Cc2cc1OC)C(=O)CCNCC(=O)N1CCC[C@H]1C#N |r|
Show InChI InChI=1S/C21H28N4O4/c1-28-18-10-15-6-9-24(14-16(15)11-19(18)29-2)20(26)5-7-23-13-21(27)25-8-3-4-17(25)12-22/h10-11,17,23H,3-9,13-14H2,1-2H3/t17-/m0/s1
Reactome pathway
n/an/a 651n/an/an/an/a8.037
National Health Research Institutes
Assay Description
The enzyme activity resulted in the liberation of free pNA at 405 nm. Reaction progress was monitored using a Molecular Devices SpectraMax Plus micro...
J Med Chem 49: 373-80 (2006)
Article DOI: 10.1021/jm0507781
BindingDB Entry DOI: 10.7270/Q28W3BJH
Dipeptidyl peptidase 2 (DPP II)
(Homo sapiens (Human))
BDBM11698
((2S)-1-(2-{[3-(6,7-dimethoxy-1,2,3,4-tetrahydroiso...)
Show SMILES COc1cc2CCN(Cc2cc1OC)C(=O)CCNCC(=O)N1CCC[C@H]1C#N |r|
Show InChI InChI=1S/C21H28N4O4/c1-28-18-10-15-6-9-24(14-16(15)11-19(18)29-2)20(26)5-7-23-13-21(27)25-8-3-4-17(25)12-22/h10-11,17,23H,3-9,13-14H2,1-2H3/t17-/m0/s1
n/an/a>1.00E+5n/an/an/an/an/an/a
National Health Research Institutes
Assay Description
The enzyme activity resulted in the liberation of free pNA at 405 nm. Reaction progress was monitored using a Molecular Devices SpectraMax Plus micro...
J Med Chem 49: 373-80 (2006)
Article DOI: 10.1021/jm0507781
BindingDB Entry DOI: 10.7270/Q28W3BJH
Dipeptidyl peptidase VIII
(Homo sapiens (Human))
BDBM11698
((2S)-1-(2-{[3-(6,7-dimethoxy-1,2,3,4-tetrahydroiso...)
Show SMILES COc1cc2CCN(Cc2cc1OC)C(=O)CCNCC(=O)N1CCC[C@H]1C#N |r|
Show InChI InChI=1S/C21H28N4O4/c1-28-18-10-15-6-9-24(14-16(15)11-19(18)29-2)20(26)5-7-23-13-21(27)25-8-3-4-17(25)12-22/h10-11,17,23H,3-9,13-14H2,1-2H3/t17-/m0/s1
n/an/a 3.34E+3n/an/an/an/an/an/a
National Health Research Institutes
Assay Description
The enzyme activity resulted in the liberation of free pNA at 405 nm. Reaction progress was monitored using a Molecular Devices SpectraMax Plus micro...
J Med Chem 49: 373-80 (2006)
Article DOI: 10.1021/jm0507781
BindingDB Entry DOI: 10.7270/Q28W3BJH