BDBM11699 (2S)-1-(2-{[3-(6-fluoro-1,2,3,4-tetrahydroisoquinolin-2-yl)-3-oxopropyl]amino}acetyl)pyrrolidine-2-carbonitrile::(2S)-Cyanopyrrolidine analogue 18c::2-[3-[2-[2-Cyano-(S)-pyrrolidin-1-yl]-2-oxoethylamino]-1-oxo-propyl]-6-fluoro-1,2,3,4-tetrahydroisoquinoline
SMILES: Fc1ccc2CN(CCc2c1)C(=O)CCNCC(=O)N1CCC[C@H]1C#N
InChI Key: InChIKey=IZKAXKCVSYQXDY-KRWDZBQOSA-N
Data: 3 IC50
Activity Spreadsheet -- Enzyme Inhibition Constant Data from BindingDB
Found 3 hits for monomerid = 11699
Trg + Lig
Ki
nM
ΔG°
kcal/mole
IC50
nM
Kd
nM
EC50/IC50
nM
koff
s-1
kon
M-1s-1
pHTemp
°C
Dipeptidyl peptidase 4
(Homo sapiens (Human))
BDBM11699
((2S)-1-(2-{[3-(6-fluoro-1,2,3,4-tetrahydroisoquino...)
Show SMILES Fc1ccc2CN(CCc2c1)C(=O)CCNCC(=O)N1CCC[C@H]1C#N |r|
Show InChI InChI=1S/C19H23FN4O2/c20-16-4-3-15-13-23(9-6-14(15)10-16)18(25)5-7-22-12-19(26)24-8-1-2-17(24)11-21/h3-4,10,17,22H,1-2,5-9,12-13H2/t17-/m0/s1
Reactome pathway
n/an/a 83n/an/an/an/a8.037
National Health Research Institutes
Assay Description
The enzyme activity resulted in the liberation of free pNA at 405 nm. Reaction progress was monitored using a Molecular Devices SpectraMax Plus micro...
J Med Chem 49: 373-80 (2006)
Article DOI: 10.1021/jm0507781
BindingDB Entry DOI: 10.7270/Q28W3BJH
Dipeptidyl peptidase 2 (DPP II)
(Homo sapiens (Human))
BDBM11699
((2S)-1-(2-{[3-(6-fluoro-1,2,3,4-tetrahydroisoquino...)
Show SMILES Fc1ccc2CN(CCc2c1)C(=O)CCNCC(=O)N1CCC[C@H]1C#N |r|
Show InChI InChI=1S/C19H23FN4O2/c20-16-4-3-15-13-23(9-6-14(15)10-16)18(25)5-7-22-12-19(26)24-8-1-2-17(24)11-21/h3-4,10,17,22H,1-2,5-9,12-13H2/t17-/m0/s1
n/an/a>1.00E+5n/an/an/an/an/an/a
National Health Research Institutes
Assay Description
The enzyme activity resulted in the liberation of free pNA at 405 nm. Reaction progress was monitored using a Molecular Devices SpectraMax Plus micro...
J Med Chem 49: 373-80 (2006)
Article DOI: 10.1021/jm0507781
BindingDB Entry DOI: 10.7270/Q28W3BJH
Dipeptidyl peptidase VIII
(Homo sapiens (Human))
BDBM11699
((2S)-1-(2-{[3-(6-fluoro-1,2,3,4-tetrahydroisoquino...)
Show SMILES Fc1ccc2CN(CCc2c1)C(=O)CCNCC(=O)N1CCC[C@H]1C#N |r|
Show InChI InChI=1S/C19H23FN4O2/c20-16-4-3-15-13-23(9-6-14(15)10-16)18(25)5-7-22-12-19(26)24-8-1-2-17(24)11-21/h3-4,10,17,22H,1-2,5-9,12-13H2/t17-/m0/s1
n/an/a 1.70E+3n/an/an/an/an/an/a
National Health Research Institutes
Assay Description
The enzyme activity resulted in the liberation of free pNA at 405 nm. Reaction progress was monitored using a Molecular Devices SpectraMax Plus micro...
J Med Chem 49: 373-80 (2006)
Article DOI: 10.1021/jm0507781
BindingDB Entry DOI: 10.7270/Q28W3BJH