BDBM117036 US8664236, A16::US9238651, A16
SMILES: Cn1cc(cn1)-c1cnc2[nH]cc(-c3cc(nc(N)n3)N(CCO)c3ccccc3Cl)c2c1
InChI Key: InChIKey=XUFFORIGCTZFNJ-UHFFFAOYSA-N
Data: 3 IC50
Activity Spreadsheet -- Enzyme Inhibition Constant Data from BindingDB
Found 3 hits for monomerid = 117036
Trg + Lig
Ki
nM
ΔG°
kcal/mole
IC50
nM
Kd
nM
EC50/IC50
nM
koff
s-1
kon
M-1s-1
pHTemp
°C
3-phosphoinositide-dependent protein kinase 1
(Homo sapiens (Human))
BDBM117036
(US8664236, A16 | US9238651, A16)
Show SMILES Cn1cc(cn1)-c1cnc2[nH]cc(-c3cc(nc(N)n3)N(CCO)c3ccccc3Cl)c2c1
Show InChI InChI=1S/C23H21ClN8O/c1-31-13-15(11-28-31)14-8-16-17(12-27-22(16)26-10-14)19-9-21(30-23(25)29-19)32(6-7-33)20-5-3-2-4-18(20)24/h2-5,8-13,33H,6-7H2,1H3,(H,26,27)(H2,25,29,30)
NCI pathway
Reactome pathway
US Patent
n/an/a 4.70n/an/an/an/an/an/a
Merck Patent GmbH
US Patent
Assay Description
The compound inhibits the target protein in the enzymatic PDK1 inhibition assay.
US Patent US8664236 (2014)
BindingDB Entry DOI: 10.7270/Q2RX99RR
3-phosphoinositide-dependent protein kinase 1
(Homo sapiens (Human))
BDBM117036
(US8664236, A16 | US9238651, A16)
Show SMILES Cn1cc(cn1)-c1cnc2[nH]cc(-c3cc(nc(N)n3)N(CCO)c3ccccc3Cl)c2c1
Show InChI InChI=1S/C23H21ClN8O/c1-31-13-15(11-28-31)14-8-16-17(12-27-22(16)26-10-14)19-9-21(30-23(25)29-19)32(6-7-33)20-5-3-2-4-18(20)24/h2-5,8-13,33H,6-7H2,1H3,(H,26,27)(H2,25,29,30)
NCI pathway
Reactome pathway
US Patent
n/an/a 2.60n/an/an/an/a8.04
MERCK PATENT GMBH
US Patent
Assay Description
The cellular assay for the determination of the PDK1 kinase activity is carried out as a Luminex assay in the 96-well format. PC3 cells are sown at...
US Patent US9238651 (2016)
BindingDB Entry DOI: 10.7270/Q2DV1HQZ
3-phosphoinositide-dependent protein kinase 1
(Homo sapiens (Human))
BDBM117036
(US8664236, A16 | US9238651, A16)
Show SMILES Cn1cc(cn1)-c1cnc2[nH]cc(-c3cc(nc(N)n3)N(CCO)c3ccccc3Cl)c2c1
Show InChI InChI=1S/C23H21ClN8O/c1-31-13-15(11-28-31)14-8-16-17(12-27-22(16)26-10-14)19-9-21(30-23(25)29-19)32(6-7-33)20-5-3-2-4-18(20)24/h2-5,8-13,33H,6-7H2,1H3,(H,26,27)(H2,25,29,30)
NCI pathway
Reactome pathway
US Patent
n/an/a 4.70n/an/an/an/an/a30
MERCK PATENT GMBH
US Patent
Assay Description
The experimental batches are carried out in a flashplate system with 384 wells/microtitration plate.In each case, the PDK1 sample His6-PDK1(Δ1-...
US Patent US9238651 (2016)
BindingDB Entry DOI: 10.7270/Q2DV1HQZ