null
SMILES: O=S(=O)(Nc1cncc(c1)-c1ccc2ncnc(OC3CCOCC3)c2n1)c1ccccc1
InChI Key: InChIKey=DFQOZTRZCLZDHI-UHFFFAOYSA-N
Activity Spreadsheet -- Enzyme Inhibition Constant Data from BindingDB
Found 3 hits for monomerid = 117066
Trg + Lig
Ki
nM
ΔG°
kcal/mole
IC50
nM
Kd
nM
EC50/IC50
nM
koff
s-1
kon
M-1s-1
pHTemp
°C
Phosphatidylinositol 3-kinase regulatory subunit alpha
(Homo sapiens (Human))
BDBM117066
(US8664230, 2)
Show SMILES O=S(=O)(Nc1cncc(c1)-c1ccc2ncnc(OC3CCOCC3)c2n1)c1ccccc1
Show InChI InChI=1S/C23H21N5O4S/c29-33(30,19-4-2-1-3-5-19)28-17-12-16(13-24-14-17)20-6-7-21-22(27-20)23(26-15-25-21)32-18-8-10-31-11-9-18/h1-7,12-15,18,28H,8-11H2
US Patent
n/an/a<1.00E+4n/an/an/an/an/an/a
The Asan Foundation
US Patent
Assay Description
The PI3 Kinase Activity/Inhibitor Assay is a competitive assay used for the fast and sensitive quantitation of activity of the four class I PI3 kinas...
US Patent US8664230 (2014)
BindingDB Entry DOI: 10.7270/Q2N58K1R
Phosphatidylinositol 4,5-bisphosphate 3-kinase catalytic subunit delta isoform
(Homo sapiens (Human))
BDBM117066
(US8664230, 2)
Show SMILES O=S(=O)(Nc1cncc(c1)-c1ccc2ncnc(OC3CCOCC3)c2n1)c1ccccc1
Show InChI InChI=1S/C23H21N5O4S/c29-33(30,19-4-2-1-3-5-19)28-17-12-16(13-24-14-17)20-6-7-21-22(27-20)23(26-15-25-21)32-18-8-10-31-11-9-18/h1-7,12-15,18,28H,8-11H2
NCI pathway
Reactome pathway
US Patent
n/an/a<1.00E+4n/an/an/an/an/an/a
The Asan Foundation
US Patent
Assay Description
The PI3 Kinase Activity/Inhibitor Assay is a competitive assay used for the fast and sensitive quantitation of activity of the four class I PI3 kinas...
US Patent US8664230 (2014)
BindingDB Entry DOI: 10.7270/Q2N58K1R
Phosphatidylinositol 4,5-bisphosphate 3-kinase catalytic subunit gamma isoform
(Homo sapiens (Human))
BDBM117066
(US8664230, 2)
Show SMILES O=S(=O)(Nc1cncc(c1)-c1ccc2ncnc(OC3CCOCC3)c2n1)c1ccccc1
Show InChI InChI=1S/C23H21N5O4S/c29-33(30,19-4-2-1-3-5-19)28-17-12-16(13-24-14-17)20-6-7-21-22(27-20)23(26-15-25-21)32-18-8-10-31-11-9-18/h1-7,12-15,18,28H,8-11H2
NCI pathway
Reactome pathway
US Patent
n/an/a<1.00E+3n/an/an/an/an/an/a
The Asan Foundation
US Patent
Assay Description
The PI3 Kinase Activity/Inhibitor Assay is a competitive assay used for the fast and sensitive quantitation of activity of the four class I PI3 kinas...
US Patent US8664230 (2014)
BindingDB Entry DOI: 10.7270/Q2N58K1R