BDBM11719 (2S)-1-(2-{[4-(2,3-dihydro-1H-isoindol-2-yl)-2-methyl-4-oxobutan-2-yl]amino}acetyl)pyrrolidine-2-carbonitrile::(2S)-Cyanopyrrolidine analogue 21d::(2S)-cyanopyrrolidine 4::2-[3-[2-[2-Cyano-(S)-pyrrolidin-1-yl]-2-oxoethylamino]-3-methyl-1-oxobutyl]-1,3-dihydroisoindole
SMILES: CC(C)(CC(=O)N1Cc2ccccc2C1)NCC(=O)N1CCC[C@H]1C#N
InChI Key: InChIKey=BXAZNJCLCXBVJT-KRWDZBQOSA-N
Data: 12 IC50
Activity Spreadsheet -- Enzyme Inhibition Constant Data from BindingDB
Found 12 hits for monomerid = 11719
Trg + Lig
Ki
nM
ΔG°
kcal/mole
IC50
nM
Kd
nM
EC50/IC50
nM
koff
s-1
kon
M-1s-1
pHTemp
°C
Dipeptidyl peptidase 4
(Homo sapiens (Human))
BDBM11719
((2S)-1-(2-{[4-(2,3-dihydro-1H-isoindol-2-yl)-2-met...)
Show SMILES CC(C)(CC(=O)N1Cc2ccccc2C1)NCC(=O)N1CCC[C@H]1C#N |r|
Show InChI InChI=1S/C20H26N4O2/c1-20(2,22-12-19(26)24-9-5-8-17(24)11-21)10-18(25)23-13-15-6-3-4-7-16(15)14-23/h3-4,6-7,17,22H,5,8-10,12-14H2,1-2H3/t17-/m0/s1
Reactome pathway
n/an/a 15n/an/an/an/a8.037
National Health Research Institutes
Assay Description
The enzyme activity resulted in the liberation of free pNA at 405 nm. Reaction progress was monitored using a Molecular Devices SpectraMax Plus micro...
Bioorg Med Chem Lett 16: 3268-72 (2006)
Article DOI: 10.1016/j.bmcl.2006.03.037
BindingDB Entry DOI: 10.7270/Q22805V8
Dipeptidyl peptidase VIII
(Homo sapiens (Human))
BDBM11719
((2S)-1-(2-{[4-(2,3-dihydro-1H-isoindol-2-yl)-2-met...)
Show SMILES CC(C)(CC(=O)N1Cc2ccccc2C1)NCC(=O)N1CCC[C@H]1C#N |r|
Show InChI InChI=1S/C20H26N4O2/c1-20(2,22-12-19(26)24-9-5-8-17(24)11-21)10-18(25)23-13-15-6-3-4-7-16(15)14-23/h3-4,6-7,17,22H,5,8-10,12-14H2,1-2H3/t17-/m0/s1
n/an/a>2.00E+4n/an/an/an/an/an/a
National Health Research Institutes
Assay Description
The enzyme activity resulted in the liberation of free pNA at 405 nm. Reaction progress was monitored using a Molecular Devices SpectraMax Plus micro...
Bioorg Med Chem Lett 16: 3268-72 (2006)
Article DOI: 10.1016/j.bmcl.2006.03.037
BindingDB Entry DOI: 10.7270/Q22805V8
Dipeptidyl peptidase 2 (DPP II)
(Homo sapiens (Human))
BDBM11719
((2S)-1-(2-{[4-(2,3-dihydro-1H-isoindol-2-yl)-2-met...)
Show SMILES CC(C)(CC(=O)N1Cc2ccccc2C1)NCC(=O)N1CCC[C@H]1C#N |r|
Show InChI InChI=1S/C20H26N4O2/c1-20(2,22-12-19(26)24-9-5-8-17(24)11-21)10-18(25)23-13-15-6-3-4-7-16(15)14-23/h3-4,6-7,17,22H,5,8-10,12-14H2,1-2H3/t17-/m0/s1
n/an/a>2.00E+4n/an/an/an/an/an/a
National Health Research Institutes
Assay Description
The enzyme activity resulted in the liberation of free pNA at 405 nm. Reaction progress was monitored using a Molecular Devices SpectraMax Plus micro...
Bioorg Med Chem Lett 16: 3268-72 (2006)
Article DOI: 10.1016/j.bmcl.2006.03.037
BindingDB Entry DOI: 10.7270/Q22805V8
Fibroblast Activation Protein (FAP)
(Homo sapiens (Human))
BDBM11719
((2S)-1-(2-{[4-(2,3-dihydro-1H-isoindol-2-yl)-2-met...)
Show SMILES CC(C)(CC(=O)N1Cc2ccccc2C1)NCC(=O)N1CCC[C@H]1C#N |r|
Show InChI InChI=1S/C20H26N4O2/c1-20(2,22-12-19(26)24-9-5-8-17(24)11-21)10-18(25)23-13-15-6-3-4-7-16(15)14-23/h3-4,6-7,17,22H,5,8-10,12-14H2,1-2H3/t17-/m0/s1
n/an/a>2.00E+4n/an/an/an/an/an/a
National Health Research Institutes
Assay Description
The enzyme activity resulted in the liberation of free pNA at 405 nm. Reaction progress was monitored using a Molecular Devices SpectraMax Plus micro...
Bioorg Med Chem Lett 16: 3268-72 (2006)
Article DOI: 10.1016/j.bmcl.2006.03.037
BindingDB Entry DOI: 10.7270/Q22805V8
Dipeptidyl peptidase 4
(Homo sapiens (Human))
BDBM11719
((2S)-1-(2-{[4-(2,3-dihydro-1H-isoindol-2-yl)-2-met...)
Show SMILES CC(C)(CC(=O)N1Cc2ccccc2C1)NCC(=O)N1CCC[C@H]1C#N |r|
Show InChI InChI=1S/C20H26N4O2/c1-20(2,22-12-19(26)24-9-5-8-17(24)11-21)10-18(25)23-13-15-6-3-4-7-16(15)14-23/h3-4,6-7,17,22H,5,8-10,12-14H2,1-2H3/t17-/m0/s1
Reactome pathway
n/an/a 15n/an/an/an/an/an/a
National Health Research Institutes
Assay Description
The enzyme activity resulted in the liberation of free pNA at 405 nm. Reaction progress was monitored using a Molecular Devices SpectraMax Plus micro...
J Med Chem 49: 373-80 (2006)
Article DOI: 10.1021/jm0507781
BindingDB Entry DOI: 10.7270/Q28W3BJH
Dipeptidyl peptidase 9
(Homo sapiens (Human))
BDBM11719
((2S)-1-(2-{[4-(2,3-dihydro-1H-isoindol-2-yl)-2-met...)
Show SMILES CC(C)(CC(=O)N1Cc2ccccc2C1)NCC(=O)N1CCC[C@H]1C#N |r|
Show InChI InChI=1S/C20H26N4O2/c1-20(2,22-12-19(26)24-9-5-8-17(24)11-21)10-18(25)23-13-15-6-3-4-7-16(15)14-23/h3-4,6-7,17,22H,5,8-10,12-14H2,1-2H3/t17-/m0/s1
n/an/a>1.00E+5n/an/an/an/an/an/a
National Health Research Institutes
Curated by ChEMBL
Assay Description
Inhibition of DPP9
Bioorg Med Chem Lett 20: 3596-600 (2010)
Article DOI: 10.1016/j.bmcl.2010.04.124
BindingDB Entry DOI: 10.7270/Q29Z953W
Dipeptidyl peptidase 2 (DPP II)
(Homo sapiens (Human))
BDBM11719
((2S)-1-(2-{[4-(2,3-dihydro-1H-isoindol-2-yl)-2-met...)
Show SMILES CC(C)(CC(=O)N1Cc2ccccc2C1)NCC(=O)N1CCC[C@H]1C#N |r|
Show InChI InChI=1S/C20H26N4O2/c1-20(2,22-12-19(26)24-9-5-8-17(24)11-21)10-18(25)23-13-15-6-3-4-7-16(15)14-23/h3-4,6-7,17,22H,5,8-10,12-14H2,1-2H3/t17-/m0/s1
n/an/a>1.00E+5n/an/an/an/an/an/a
National Health Research Institutes
Assay Description
The enzyme activity resulted in the liberation of free pNA at 405 nm. Reaction progress was monitored using a Molecular Devices SpectraMax Plus micro...
J Med Chem 49: 373-80 (2006)
Article DOI: 10.1021/jm0507781
BindingDB Entry DOI: 10.7270/Q28W3BJH
Fibroblast activation protein alpha
(Homo sapiens (Human))
BDBM11719
((2S)-1-(2-{[4-(2,3-dihydro-1H-isoindol-2-yl)-2-met...)
Show SMILES CC(C)(CC(=O)N1Cc2ccccc2C1)NCC(=O)N1CCC[C@H]1C#N |r|
Show InChI InChI=1S/C20H26N4O2/c1-20(2,22-12-19(26)24-9-5-8-17(24)11-21)10-18(25)23-13-15-6-3-4-7-16(15)14-23/h3-4,6-7,17,22H,5,8-10,12-14H2,1-2H3/t17-/m0/s1
n/an/a>1.00E+5n/an/an/an/an/an/a
National Health Research Institutes
Curated by ChEMBL
Assay Description
Inhibition of FAP
Bioorg Med Chem Lett 20: 3596-600 (2010)
Article DOI: 10.1016/j.bmcl.2010.04.124
BindingDB Entry DOI: 10.7270/Q29Z953W
Dipeptidyl peptidase VIII
(Homo sapiens (Human))
BDBM11719
((2S)-1-(2-{[4-(2,3-dihydro-1H-isoindol-2-yl)-2-met...)
Show SMILES CC(C)(CC(=O)N1Cc2ccccc2C1)NCC(=O)N1CCC[C@H]1C#N |r|
Show InChI InChI=1S/C20H26N4O2/c1-20(2,22-12-19(26)24-9-5-8-17(24)11-21)10-18(25)23-13-15-6-3-4-7-16(15)14-23/h3-4,6-7,17,22H,5,8-10,12-14H2,1-2H3/t17-/m0/s1
n/an/a>1.00E+5n/an/an/an/an/an/a
National Health Research Institutes
Curated by ChEMBL
Assay Description
Inhibition of DPP8
Bioorg Med Chem Lett 20: 3596-600 (2010)
Article DOI: 10.1016/j.bmcl.2010.04.124
BindingDB Entry DOI: 10.7270/Q29Z953W
Dipeptidyl peptidase 4
(Homo sapiens (Human))
BDBM11719
((2S)-1-(2-{[4-(2,3-dihydro-1H-isoindol-2-yl)-2-met...)
Show SMILES CC(C)(CC(=O)N1Cc2ccccc2C1)NCC(=O)N1CCC[C@H]1C#N |r|
Show InChI InChI=1S/C20H26N4O2/c1-20(2,22-12-19(26)24-9-5-8-17(24)11-21)10-18(25)23-13-15-6-3-4-7-16(15)14-23/h3-4,6-7,17,22H,5,8-10,12-14H2,1-2H3/t17-/m0/s1
Reactome pathway
n/an/a 15n/an/an/an/an/an/a
National Health Research Institutes
Curated by ChEMBL
Assay Description
Inhibition of DPP4
Bioorg Med Chem Lett 20: 3596-600 (2010)
Article DOI: 10.1016/j.bmcl.2010.04.124
BindingDB Entry DOI: 10.7270/Q29Z953W
Dipeptidyl peptidase 2 (DPP II)
(Homo sapiens (Human))
BDBM11719
((2S)-1-(2-{[4-(2,3-dihydro-1H-isoindol-2-yl)-2-met...)
Show SMILES CC(C)(CC(=O)N1Cc2ccccc2C1)NCC(=O)N1CCC[C@H]1C#N |r|
Show InChI InChI=1S/C20H26N4O2/c1-20(2,22-12-19(26)24-9-5-8-17(24)11-21)10-18(25)23-13-15-6-3-4-7-16(15)14-23/h3-4,6-7,17,22H,5,8-10,12-14H2,1-2H3/t17-/m0/s1
n/an/a>1.00E+5n/an/an/an/an/an/a
National Health Research Institutes
Curated by ChEMBL
Assay Description
Inhibition of DPP2
Bioorg Med Chem Lett 20: 3596-600 (2010)
Article DOI: 10.1016/j.bmcl.2010.04.124
BindingDB Entry DOI: 10.7270/Q29Z953W
Dipeptidyl peptidase VIII
(Homo sapiens (Human))
BDBM11719
((2S)-1-(2-{[4-(2,3-dihydro-1H-isoindol-2-yl)-2-met...)
Show SMILES CC(C)(CC(=O)N1Cc2ccccc2C1)NCC(=O)N1CCC[C@H]1C#N |r|
Show InChI InChI=1S/C20H26N4O2/c1-20(2,22-12-19(26)24-9-5-8-17(24)11-21)10-18(25)23-13-15-6-3-4-7-16(15)14-23/h3-4,6-7,17,22H,5,8-10,12-14H2,1-2H3/t17-/m0/s1
n/an/a>1.00E+5n/an/an/an/an/an/a
National Health Research Institutes
Assay Description
The enzyme activity resulted in the liberation of free pNA at 405 nm. Reaction progress was monitored using a Molecular Devices SpectraMax Plus micro...
J Med Chem 49: 373-80 (2006)
Article DOI: 10.1021/jm0507781
BindingDB Entry DOI: 10.7270/Q28W3BJH