BDBM117676 US8653087, III-356
SMILES: COc1ccc(NC(=O)c2ccc(C)c(Nc3ncnc4cnc(NC5CCOC5)nc34)c2)cc1C(F)(F)F
InChI Key: InChIKey=MCUVARULMRXQNY-UHFFFAOYSA-N
Data: 1 IC50
Activity Spreadsheet -- Enzyme Inhibition Constant Data from BindingDB
Found 1 hit for monomerid = 117676
Trg + Lig
Ki
nM
ΔG°
kcal/mole
IC50
nM
Kd
nM
EC50/IC50
nM
koff
s-1
kon
M-1s-1
pHTemp
°C
B-RAF V600E
(Homo sapiens (Human))
BDBM117676
(US8653087, III-356)
Show SMILES COc1ccc(NC(=O)c2ccc(C)c(Nc3ncnc4cnc(NC5CCOC5)nc34)c2)cc1C(F)(F)F
Show InChI InChI=1S/C26H24F3N7O3/c1-14-3-4-15(24(37)33-16-5-6-21(38-2)18(10-16)26(27,28)29)9-19(14)35-23-22-20(31-13-32-23)11-30-25(36-22)34-17-7-8-39-12-17/h3-6,9-11,13,17H,7-8,12H2,1-2H3,(H,33,37)(H,30,34,36)(H,31,32,35)
US Patent
n/an/a<1n/an/an/an/a7.5n/a
Boehringer Ingelheim International GmbH
US Patent
Assay Description
The final concentration of DMSO is 5%. 10 μL of the B-Raf (V600E)-kinase solution are pipetted in (containing 0.5 ng B-Raf (V600E)-kinase in 20 ...
US Patent US8653087 (2014)
BindingDB Entry DOI: 10.7270/Q2CR5S1G