BDBM1178 N-(3-{cyclopropyl[4-hydroxy-2-oxo-6-(1-phenylbutan-2-yl)-2H-pyran-3-yl]methyl}phenyl)-1-methyl-1H-imidazole-4-sulfonamide::N-[3-[[S or R]-Cyclopropyl[4-hydroxy-2-oxo-6-[1(S)-(phenylmethyl)propyl]-2H-pyran-3-yl]methyl]phenyl]-1-methyl-1H-imidazole-4-sulfonamide::Sulfonamide-Containing 4-Hydroxy-2-pyrone deriv. XVIII
SMILES: CCC(Cc1ccccc1)c1cc(O)c(C(C2CC2)c2cccc(NS(=O)(=O)c3cn(C)cn3)c2)c(=O)o1
InChI Key: InChIKey=AJPKIPJBVMYDNN-UHFFFAOYSA-N
Data: 1 KI
Activity Spreadsheet -- Enzyme Inhibition Constant Data from BindingDB
Found 1 hit for monomerid = 1178
Trg + Lig
Ki
nM
ΔG°
kcal/mole
IC50
nM
Kd
nM
EC50/IC50
nM
koff
s-1
kon
M-1s-1
pHTemp
°C
HIV-1 Protease
(Human immunodeficiency virus type 1)
BDBM1178
(N-(3-{cyclopropyl[4-hydroxy-2-oxo-6-(1-phenylbutan...)
Show SMILES CCC(Cc1ccccc1)c1cc(O)c(C(C2CC2)c2cccc(NS(=O)(=O)c3cn(C)cn3)c2)c(=O)o1
Show InChI InChI=1S/C29H31N3O5S/c1-3-20(14-19-8-5-4-6-9-19)25-16-24(33)28(29(34)37-25)27(21-12-13-21)22-10-7-11-23(15-22)31-38(35,36)26-17-32(2)18-30-26/h4-11,15-18,20-21,27,31,33H,3,12-14H2,1-2H3
1.30 -12.0n/an/an/an/an/a5.022
Upjohn
Assay Description
HIV-1 protease was purified and refolded from E. coli inclusion bodies. The substrate used spans the p17-p24 processing site (R-V-S-Q-N-Y-P-I-V-Q-N-K...
J Med Chem 39: 2400-10 (1996)
Article DOI: 10.1021/jm950888f
BindingDB Entry DOI: 10.7270/Q20K26RK