BDBM11821 (3R,4R)-N-(4-{4-[5-(4,4-dimethylpiperidin-1-yl)-2-hydroxybenzoyl]benzoylamino}azepan-3-yl)isonicotinamide hydrochloride::N-[(3R,4R)-4-[(4-{[5-(4,4-dimethylpiperidin-1-yl)-2-hydroxyphenyl]carbonyl}benzene)amido]azepan-3-yl]pyridine-4-carboxamide hydrochloride::Protein Kinase B-Selective Inhibitor 5
SMILES: CC1(C)CCN(CC1)c1ccc(O)c(c1)C(=O)c1ccc(cc1)C(=O)N[C@@H]1CCCNC[C@H]1NC(=O)c1ccncc1
InChI Key: InChIKey=YGHLZBJWLNYECG-VSGBNLITSA-N
Data: 2 IC50
PDB links: 1 PDB ID matches this monomer. 3 PDB IDs contain inhibitors having a similarity of 90% to this monomer.
Activity Spreadsheet -- Enzyme Inhibition Constant Data from BindingDB
Found 2 hits for monomerid = 11821
Trg + Lig
Ki
nM
ΔG°
kcal/mole
IC50
nM
Kd
nM
EC50/IC50
nM
koff
s-1
kon
M-1s-1
pHTemp
°C
cAMP-Dependent Protein Kinase (PKA)
(Bos taurus (bovine))
BDBM11821
((3R,4R)-N-(4-{4-[5-(4,4-dimethylpiperidin-1-yl)-2-...)
Show SMILES CC1(C)CCN(CC1)c1ccc(O)c(c1)C(=O)c1ccc(cc1)C(=O)N[C@@H]1CCCNC[C@H]1NC(=O)c1ccncc1 |r|
Show InChI InChI=1S/C33H39N5O4/c1-33(2)13-18-38(19-14-33)25-9-10-29(39)26(20-25)30(40)22-5-7-23(8-6-22)31(41)36-27-4-3-15-35-21-28(27)37-32(42)24-11-16-34-17-12-24/h5-12,16-17,20,27-28,35,39H,3-4,13-15,18-19,21H2,1-2H3,(H,36,41)(H,37,42)/t27-,28-/m1/s1
n/an/a 1.70E+3n/an/an/an/a7.222
Max-Planck-Institut fuer Biochemie
Assay Description
In this assay, a fluorescent phosphopeptide tracer and the nonfluorescent phosphopeptides generated during a PKA reaction compete for binding to an a...
J Med Chem 48: 163-70 (2005)
Article DOI: 10.1021/jm049701n
BindingDB Entry DOI: 10.7270/Q21C1V3S
3D
3D Structure (crystal)
RAC-alpha serine/threonine-protein kinase
(Homo sapiens (Human))
BDBM11821
((3R,4R)-N-(4-{4-[5-(4,4-dimethylpiperidin-1-yl)-2-...)
Show SMILES CC1(C)CCN(CC1)c1ccc(O)c(c1)C(=O)c1ccc(cc1)C(=O)N[C@@H]1CCCNC[C@H]1NC(=O)c1ccncc1 |r|
Show InChI InChI=1S/C33H39N5O4/c1-33(2)13-18-38(19-14-33)25-9-10-29(39)26(20-25)30(40)22-5-7-23(8-6-22)31(41)36-27-4-3-15-35-21-28(27)37-32(42)24-11-16-34-17-12-24/h5-12,16-17,20,27-28,35,39H,3-4,13-15,18-19,21H2,1-2H3,(H,36,41)(H,37,42)/t27-,28-/m1/s1
n/an/a 40n/an/an/an/a7.522
Max-Planck-Institut fuer Biochemie
Assay Description
An ELISA-based assay has been developed for the serine/threonine kinase, PKB-alpha. The assay utilizes an N-terminally biotinylated substrate peptide...
J Med Chem 48: 163-70 (2005)
Article DOI: 10.1021/jm049701n
BindingDB Entry DOI: 10.7270/Q21C1V3S