null
SMILES: O=c1c(c[nH]n1-c1cc(ncn1)C1CC1)-n1ccnn1
InChI Key: InChIKey=OFCRVHFAFKTUNE-UHFFFAOYSA-N
Activity Spreadsheet -- Enzyme Inhibition Constant Data from BindingDB
Found 1 hit for monomerid = 118331
Trg + Lig
Ki
nM
ΔG°
kcal/mole
IC50
nM
Kd
nM
EC50/IC50
nM
koff
s-1
kon
M-1s-1
pHTemp
°C
Prolyl hydroxylase EGLN2
(Homo sapiens (Human))
BDBM118331
(US8653111, 17)
Show SMILES O=c1c(c[nH]n1-c1cc(ncn1)C1CC1)-n1ccnn1
Show InChI InChI=1S/C12H11N7O/c20-12-10(18-4-3-15-17-18)6-16-19(12)11-5-9(8-1-2-8)13-7-14-11/h3-8,16H,1-2H2
Reactome pathway
US Patent
n/an/a 560n/an/an/an/an/an/a
Bayer Intellectual Property GmbH
US Patent
Assay Description
Hydroxylated HIF bonds specifically to the von Hippel-Lindau protein-elongin B-elongin C complex (VBC complex). This interaction occurs only if HIF i...
US Patent US8653111 (2014)
BindingDB Entry DOI: 10.7270/Q2GH9GMD