BDBM118337 US8653111, 61
SMILES: Cc1cc(ncc1Br)-n1[nH]cc(-n2ccnn2)c1=O
InChI Key: InChIKey=UFDYJEHRYNGKFP-UHFFFAOYSA-N
Data: 1 IC50
Activity Spreadsheet -- Enzyme Inhibition Constant Data from BindingDB
Found 1 hit for monomerid = 118337
Trg + Lig
Ki
nM
ΔG°
kcal/mole
IC50
nM
Kd
nM
EC50/IC50
nM
koff
s-1
kon
M-1s-1
pHTemp
°C
Prolyl hydroxylase EGLN2
(Homo sapiens (Human))
BDBM118337
(US8653111, 61)
Show SMILES Cc1cc(ncc1Br)-n1[nH]cc(-n2ccnn2)c1=O
Show InChI InChI=1S/C11H9BrN6O/c1-7-4-10(13-5-8(7)12)18-11(19)9(6-15-18)17-3-2-14-16-17/h2-6,15H,1H3
Reactome pathway
US Patent
n/an/a 1.10E+3n/an/an/an/an/an/a
Bayer Intellectual Property GmbH
US Patent
Assay Description
Hydroxylated HIF bonds specifically to the von Hippel-Lindau protein-elongin B-elongin C complex (VBC complex). This interaction occurs only if HIF i...
US Patent US8653111 (2014)
BindingDB Entry DOI: 10.7270/Q2GH9GMD