BDBM119083 MurC inhibitor (compound 22)
SMILES: Cc1ccc(s1)C(=O)NS(=O)(=O)c1ccc(cc1)-c1cc2cc(ccc2o1)-c1ccccc1
InChI Key: InChIKey=YDBPZXFOMVKPLR-UHFFFAOYSA-N
Data: 1 IC50
Activity Spreadsheet -- Enzyme Inhibition Constant Data from BindingDB
Found 1 hit for monomerid = 119083
Trg + Lig
Ki
nM
ΔG°
kcal/mole
IC50
nM
Kd
nM
EC50/IC50
nM
koff
s-1
kon
M-1s-1
pHTemp
°C
MurC
(Escherichia coli)
BDBM119083
(MurC inhibitor (compound 22))
Show SMILES Cc1ccc(s1)C(=O)NS(=O)(=O)c1ccc(cc1)-c1cc2cc(ccc2o1)-c1ccccc1
Show InChI InChI=1S/C26H19NO4S2/c1-17-7-14-25(32-17)26(28)27-33(29,30)22-11-8-19(9-12-22)24-16-21-15-20(10-13-23(21)31-24)18-5-3-2-4-6-18/h2-16H,1H3,(H,27,28)
n/an/a 2.30E+3n/an/an/an/an/an/a
University of Ljubljana, A?kerceva 7, 1000 Ljubljana, Slovenia
Bioorg Chem 55: 2-15 (2014)
Article DOI: 10.1016/j.bioorg.2014.03.008
BindingDB Entry DOI: 10.7270/Q2ZG6QWR