BDBM11919 (1S,3S,5S)-2-{[(2S,3S)-3-methylpyrrolidin-2-yl]carbonyl}-2-azabicyclo[3.1.0]hexane-3-carbonitrile::substituted diprolyl nitrile 12
SMILES: C[C@H]1CCN[C@@H]1C(=O)N1[C@H]2C[C@H]2C[C@H]1C#N
InChI Key: InChIKey=SRJDFBGUQNTOPB-SSRBZLIGSA-N
Data: 1 KI
Activity Spreadsheet -- Enzyme Inhibition Constant Data from BindingDB
Found 1 hit for monomerid = 11919
Trg + Lig
Ki
nM
ΔG°
kcal/mole
IC50
nM
Kd
nM
EC50/IC50
nM
koff
s-1
kon
M-1s-1
pHTemp
°C
Dipeptidyl peptidase IV
(Sus scrofa (pig))
BDBM11919
((1S,3S,5S)-2-{[(2S,3S)-3-methylpyrrolidin-2-yl]car...)
Show SMILES C[C@H]1CCN[C@@H]1C(=O)N1[C@H]2C[C@H]2C[C@H]1C#N |r|
Show InChI InChI=1S/C12H17N3O/c1-7-2-3-14-11(7)12(16)15-9(6-13)4-8-5-10(8)15/h7-11,14H,2-5H2,1H3/t7-,8+,9-,10-,11-/m0/s1
Reactome pathway
126 -9.31n/an/an/an/an/a7.422
Bristol-Myers Squibb Pharmaceutical Research Institute
Assay Description
Inhibition of human DPP-IV activity was measured under steady-state conditions by following the absorbance increase at 405 nm upon the substrate clea...
Bioorg Med Chem Lett 15: 3992-5 (2005)
Article DOI: 10.1016/j.bmcl.2005.06.043
BindingDB Entry DOI: 10.7270/Q2CN7259