BDBM11937 (4S)-2-(3-methoxyphenyl)-4-(methylamino)-1,1-dioxo-2H,3H,4H-1,7,2-thieno[3,2-e][1,2]thiazine-6-sulfonamide::(S)-3,4-DIHYDRO-2-(3-METHOXYPHENYL)-4-METHYLAMINO-2H-THIENO[3,2-E]-1,2-THIAZINE-6-SULFONAMIDE-1,1-DIOXIDE::AL7099
SMILES: CN[C@@H]1CN(c2cccc(OC)c2)S(=O)(=O)c2sc(cc12)S(N)(=O)=O
InChI Key: InChIKey=RMOXCYSVWCHXII-GFCCVEGCSA-N
Data: 1 Kd
PDB links: 1 PDB ID matches this monomer. 1 PDB ID contains this monomer as substructures. 2 PDB IDs contain inhibitors having a similarity of 90% to this monomer.
Activity Spreadsheet -- Enzyme Inhibition Constant Data from BindingDB
Found 1 hit for monomerid = 11937
Trg + Lig
Ki
nM
ΔG°
kcal/mole
IC50
nM
Kd
nM
EC50/IC50
nM
koff
s-1
kon
M-1s-1
pHTemp
°C
Carbonic anhydrase 2
(Homo sapiens (Human))
BDBM11937
((4S)-2-(3-methoxyphenyl)-4-(methylamino)-1,1-dioxo...)
Show SMILES CN[C@@H]1CN(c2cccc(OC)c2)S(=O)(=O)c2sc(cc12)S(N)(=O)=O |r|
Show InChI InChI=1S/C14H17N3O5S3/c1-16-12-8-17(9-4-3-5-10(6-9)22-2)25(20,21)14-11(12)7-13(23-14)24(15,18)19/h3-7,12,16H,8H2,1-2H3,(H2,15,18,19)/t12-/m1/s1
Reactome pathway
n/an/an/a 1.70n/an/an/a7.437
University of Pennsylvania
Assay Description
The binding of test compounds to purified human erythrocyte carbonic anhydrase II was determined by a fluorescence competition assay using a Perkin-E...
Protein Sci 7: 2483-9 (1998)
Article DOI: 10.1002/pro.5560071201
BindingDB Entry DOI: 10.7270/Q27W69FK
3D
3D Structure (docked)