BDBM119428 US8669266, 679
SMILES: Cc1ccc2c(OCC(=O)N3CCC[C@H]3C(=O)NC3CCC3)cc(nc2c1)C(=O)NCC(=O)N1CCN(CC1)C(=O)OCCC(F)(F)F
InChI Key: InChIKey=YUFSRINASKPLEY-VWLOTQADSA-N
Data: 1 IC50
Activity Spreadsheet -- Enzyme Inhibition Constant Data from BindingDB
Found 1 hit for monomerid = 119428
Trg + Lig
Ki
nM
ΔG°
kcal/mole
IC50
nM
Kd
nM
EC50/IC50
nM
koff
s-1
kon
M-1s-1
pHTemp
°C
Purinergic receptor P2Y12
(Homo sapiens (Human))
BDBM119428
(US8669266, 679)
Show SMILES Cc1ccc2c(OCC(=O)N3CCC[C@H]3C(=O)NC3CCC3)cc(nc2c1)C(=O)NCC(=O)N1CCN(CC1)C(=O)OCCC(F)(F)F
Show InChI InChI=1S/C32H39F3N6O7/c1-20-7-8-22-23(16-20)38-24(17-26(22)48-19-28(43)41-10-3-6-25(41)30(45)37-21-4-2-5-21)29(44)36-18-27(42)39-11-13-40(14-12-39)31(46)47-15-9-32(33,34)35/h7-8,16-17,21,25H,2-6,9-15,18-19H2,1H3,(H,36,44)(H,37,45)/t25-/m0/s1
Reactome pathway
US Patent
n/an/a 3n/an/an/an/an/an/a
Sanofi
US Patent
Assay Description
The ability of a test compound to bind to the P2Y12 receptor was evaluated in a recombinant cell membrane binding assay. In this competitive binding ...
US Patent US8669266 (2014)
BindingDB Entry DOI: 10.7270/Q2DJ5D9R