BDBM119878 SL827::US9073941, 500
SMILES: COc1ccc(NC(=O)CN(C)S(=O)(=O)c2cc(Br)cnc2N)cc1
InChI Key: InChIKey=HMNYMNWOUAJOIH-UHFFFAOYSA-N
Data: 2 KI  2 IC50
PDB links: 1 PDB ID matches this monomer.
Activity Spreadsheet -- Enzyme Inhibition Constant Data from BindingDB
Found 4 hits for monomerid = 119878
Trg + Lig
Ki
nM
ΔG°
kcal/mole
IC50
nM
Kd
nM
EC50/IC50
nM
koff
s-1
kon
M-1s-1
pHTemp
°C
Dihydrolipoyl dehydrogenase (Lpd)
(Mycobacterium tuberculosis)
BDBM119878
(SL827 | US9073941, 500)
Show SMILES COc1ccc(NC(=O)CN(C)S(=O)(=O)c2cc(Br)cnc2N)cc1
Show InChI InChI=1S/C15H17BrN4O4S/c1-20(25(22,23)13-7-10(16)8-18-15(13)17)9-14(21)19-11-3-5-12(24-2)6-4-11/h3-8H,9H2,1-2H3,(H2,17,18)(H,19,21)
Reactome pathway
140n/an/an/an/an/an/an/an/a
Weill Cornell Medical College
Assay Description
IC50 values were determined with serial dilutions (from 100 to 0.1 uM) of inhibitors by a spectrophotometric assay with DTNB, lipoamide, and NADH or ...
Biochemistry 52: 9375-84 (2013)
Article DOI: 10.1021/bi401077f
BindingDB Entry DOI: 10.7270/Q29K48X6
3D
3D Structure (crystal)
Prephenate dehydrogenase TyrA (PDH)
(Mycobacterium tuberculosis H37Rv)
BDBM119878
(SL827 | US9073941, 500)
Show SMILES COc1ccc(NC(=O)CN(C)S(=O)(=O)c2cc(Br)cnc2N)cc1
Show InChI InChI=1S/C15H17BrN4O4S/c1-20(25(22,23)13-7-10(16)8-18-15(13)17)9-14(21)19-11-3-5-12(24-2)6-4-11/h3-8H,9H2,1-2H3,(H2,17,18)(H,19,21)
155n/an/an/an/an/an/an/an/a
Weill Cornell Medical College
Assay Description
IC50 values were determined with serial dilutions (from 100 to 0.1 uM) of inhibitors by a spectrophotometric assay with DTNB, lipoamide, and NADH or ...
Biochemistry 52: 9375-84 (2013)
Article DOI: 10.1021/bi401077f
BindingDB Entry DOI: 10.7270/Q29K48X6
Lipoamide Dehydrogenase (Lpd)
(Mycobacterium tuberculosis)
BDBM119878
(SL827 | US9073941, 500)
Show SMILES COc1ccc(NC(=O)CN(C)S(=O)(=O)c2cc(Br)cnc2N)cc1
Show InChI InChI=1S/C15H17BrN4O4S/c1-20(25(22,23)13-7-10(16)8-18-15(13)17)9-14(21)19-11-3-5-12(24-2)6-4-11/h3-8H,9H2,1-2H3,(H2,17,18)(H,19,21)
US Patent
n/an/a 960n/an/an/an/a7.0n/a
Academia Sinica
US Patent
Assay Description
The assay was performed in a manner similar to that described in Bryk et al., Biochemistry (2010) 49:1616-1627 and modified for an online robotics sc...
US Patent US9073941 (2015)
BindingDB Entry DOI: 10.7270/Q2HX1BGC
3D
3D Structure (crystal)
Pyruvate dehydrogenase (PDH)
(Mycobacterium tuberculosis)
BDBM119878
(SL827 | US9073941, 500)
Show SMILES COc1ccc(NC(=O)CN(C)S(=O)(=O)c2cc(Br)cnc2N)cc1
Show InChI InChI=1S/C15H17BrN4O4S/c1-20(25(22,23)13-7-10(16)8-18-15(13)17)9-14(21)19-11-3-5-12(24-2)6-4-11/h3-8H,9H2,1-2H3,(H2,17,18)(H,19,21)
US Patent
n/an/a 674n/an/an/an/a7.0n/a
Academia Sinica
US Patent
Assay Description
Mtb PDH (Lpd+DlaT+AceE) is provided by Dr. Bryk Ruslana. The assay was performed in a manner similar to that described in Bryk et al., Biochemistry (...
US Patent US9073941 (2015)
BindingDB Entry DOI: 10.7270/Q2HX1BGC