BDBM119949 US8697911, 104
SMILES: CN(C)[C@H]1CCc2nc(NC(=O)c3cccc(CNC(=O)c4ccc(cc4)-n4nnnc4C)c3)sc2C1
InChI Key: InChIKey=MDMDDLBGJKODKN-NRFANRHFSA-N
Data: 1 IC50
Activity Spreadsheet -- Enzyme Inhibition Constant Data from BindingDB
Found 1 hit for monomerid = 119949
Trg + Lig
Ki
nM
ΔG°
kcal/mole
IC50
nM
Kd
nM
EC50/IC50
nM
koff
s-1
kon
M-1s-1
pHTemp
°C
Rho-associated protein kinase 2
(Homo sapiens (Human))
BDBM119949
(US8697911, 104)
Show SMILES CN(C)[C@H]1CCc2nc(NC(=O)c3cccc(CNC(=O)c4ccc(cc4)-n4nnnc4C)c3)sc2C1 |r|
Show InChI InChI=1S/C26H28N8O2S/c1-16-30-31-32-34(16)20-9-7-18(8-10-20)24(35)27-15-17-5-4-6-19(13-17)25(36)29-26-28-22-12-11-21(33(2)3)14-23(22)37-26/h4-10,13,21H,11-12,14-15H2,1-3H3,(H,27,35)(H,28,29,36)/t21-/m0/s1
US Patent
n/an/a 0.430n/an/an/an/a7.2n/a
Boehringer Ingelheim International GmbH
US Patent
Assay Description
This assay is performed using FAM S6 substrate peptide (Catalogue #R7184) and IMAP FP Screening Express Kit detection reagents from Molecular Devices...
US Patent US8697911 (2014)
BindingDB Entry DOI: 10.7270/Q25X27KR