BDBM11996 2-[4-(2,5-dimethyl-1H-pyrrol-1-yl)phenyl]acetic acid::Interchim compound 58
SMILES: Cc1ccc(C)n1-c1ccc(CC(O)=O)cc1
InChI Key: InChIKey=OJKIUURDWZWFAM-UHFFFAOYSA-N
Data: 1 KI  1 IC50
Activity Spreadsheet -- Enzyme Inhibition Constant Data from BindingDB
Found 1 hit for monomerid = 11996
Trg + Lig
Ki
nM
ΔG°
kcal/mole
IC50
nM
Kd
nM
EC50/IC50
nM
koff
s-1
kon
M-1s-1
pHTemp
°C
Anthrax Lethal Factor (LF)
(Bacillus anthracis)
BDBM11996
(2-[4-(2,5-dimethyl-1H-pyrrol-1-yl)phenyl]acetic ac...)
Show SMILES Cc1ccc(C)n1-c1ccc(CC(O)=O)cc1
Show InChI InChI=1S/C14H15NO2/c1-10-3-4-11(2)15(10)13-7-5-12(6-8-13)9-14(16)17/h3-8H,9H2,1-2H3,(H,16,17)
NCI pathway
Reactome pathway
900 -8.30 7.60E+3n/an/an/an/a7.227
Montana State University
Assay Description
For selected lead compounds from fluorescence-based high-throughput screening, the concentrations of inhibitor that caused 50% inhibition of enzymati...
J Med Chem 49: 5232-44 (2006)
Article DOI: 10.1021/jm0605132
BindingDB Entry DOI: 10.7270/Q20C4T19