BDBM120136 US8697708, 56
SMILES: Cc1cc(Nc2nccc3nc(sc23)-c2ccccc2Cl)nc(C)n1
InChI Key: InChIKey=GRYIJVOHSRGZOX-UHFFFAOYSA-N
Data: 1 KI
Activity Spreadsheet -- Enzyme Inhibition Constant Data from BindingDB
Found 1 hit for monomerid = 120136
Trg + Lig
Ki
nM
ΔG°
kcal/mole
IC50
nM
Kd
nM
EC50/IC50
nM
koff
s-1
kon
M-1s-1
pHTemp
°C
Non-receptor tyrosine-protein kinase TYK2
(Homo sapiens (Human))
BDBM120136
(US8697708, 56)
Show SMILES Cc1cc(Nc2nccc3nc(sc23)-c2ccccc2Cl)nc(C)n1
Show InChI InChI=1S/C18H14ClN5S/c1-10-9-15(22-11(2)21-10)24-17-16-14(7-8-20-17)23-18(25-16)12-5-3-4-6-13(12)19/h3-9H,1-2H3,(H,20,21,22,24)
US Patent
8.60 -10.9n/an/an/an/an/a7.222
F. Hoffmann-La Roche AG
US Patent
Assay Description
To determine the inhibition constants (Ki) of Examples 1-240, compounds were diluted serially in DMSO and added to 50 μL kinase reactions contai...
US Patent US8697708 (2014)
BindingDB Entry DOI: 10.7270/Q2J38R6F