BDBM120141 US8697708, 224
SMILES: Nc1cc(Nc2ncc(C#N)c3nc(sc23)-c2c(F)cccc2[N+]#[C-])ncn1
InChI Key: InChIKey=ZOPCEUMMRKOTBV-UHFFFAOYSA-N
Data: 1 KI
Activity Spreadsheet -- Enzyme Inhibition Constant Data from BindingDB
Found 1 hit for monomerid = 120141
Trg + Lig
Ki
nM
ΔG°
kcal/mole
IC50
nM
Kd
nM
EC50/IC50
nM
koff
s-1
kon
M-1s-1
pHTemp
°C
Non-receptor tyrosine-protein kinase TYK2
(Homo sapiens (Human))
BDBM120141
(US8697708, 224)
Show SMILES Nc1cc(Nc2ncc(C#N)c3nc(sc23)-c2c(F)cccc2[N+]#[C-])ncn1
Show InChI InChI=1S/C18H9FN8S/c1-22-11-4-2-3-10(19)14(11)18-27-15-9(6-20)7-23-17(16(15)28-18)26-13-5-12(21)24-8-25-13/h2-5,7-8H,(H3,21,23,24,25,26)
US Patent
0.300 -12.9n/an/an/an/an/a7.222
F. Hoffmann-La Roche AG
US Patent
Assay Description
To determine the inhibition constants (Ki) of Examples 1-240, compounds were diluted serially in DMSO and added to 50 μL kinase reactions contai...
US Patent US8697708 (2014)
BindingDB Entry DOI: 10.7270/Q2J38R6F