BDBM120142 US8697708, 227
SMILES: Cc1cc(Nc2nccc3nc(sc23)-c2c(cc(cc2[N+]#[C-])C#N)[N+]#[C-])nc(C)n1
InChI Key: InChIKey=OYQGWYBFFRWTPQ-UHFFFAOYSA-N
Data: 1 KI
Activity Spreadsheet -- Enzyme Inhibition Constant Data from BindingDB
Found 1 hit for monomerid = 120142
Trg + Lig
Ki
nM
ΔG°
kcal/mole
IC50
nM
Kd
nM
EC50/IC50
nM
koff
s-1
kon
M-1s-1
pHTemp
°C
Non-receptor tyrosine-protein kinase TYK2
(Homo sapiens (Human))
BDBM120142
(US8697708, 227)
Show SMILES Cc1cc(Nc2nccc3nc(sc23)-c2c(cc(cc2[N+]#[C-])C#N)[N+]#[C-])nc(C)n1
Show InChI InChI=1S/C21H12N8S/c1-11-7-17(27-12(2)26-11)29-20-19-14(5-6-25-20)28-21(30-19)18-15(23-3)8-13(10-22)9-16(18)24-4/h5-9H,1-2H3,(H,25,26,27,29)
US Patent
0.800 -12.3n/an/an/an/an/a7.222
F. Hoffmann-La Roche AG
US Patent
Assay Description
To determine the inhibition constants (Ki) of Examples 1-240, compounds were diluted serially in DMSO and added to 50 μL kinase reactions contai...
US Patent US8697708 (2014)
BindingDB Entry DOI: 10.7270/Q2J38R6F