BDBM12016 2,3-difluoro-SBB::4-(AMINOSULFONYL)-N-[(2,3-DIFLUOROPHENYL)METHYL]-BENZAMIDE::N-[(2,3-difluorophenyl)methyl]-4-sulfamoylbenzamide
SMILES: NS(=O)(=O)c1ccc(cc1)C(=O)NCc1cccc(F)c1F
InChI Key: InChIKey=QASSMVGOSBNFQY-UHFFFAOYSA-N
Data: 1 Kd
PDB links: 2 PDB IDs match this monomer. 3 PDB IDs contain this monomer as substructures. 3 PDB IDs contain inhibitors having a similarity of 90% to this monomer.
Activity Spreadsheet -- Enzyme Inhibition Constant Data from BindingDB
Found 1 hit for monomerid = 12016
Trg + Lig
Ki
nM
ΔG°
kcal/mole
IC50
nM
Kd
nM
EC50/IC50
nM
koff
s-1
kon
M-1s-1
pHTemp
°C
Carbonic Anhydrase II Mutant (F131V)
(Homo sapiens (Human))
BDBM12016
(2,3-difluoro-SBB | 4-(AMINOSULFONYL)-N-[(2,3-DIFLU...)
Show SMILES NS(=O)(=O)c1ccc(cc1)C(=O)NCc1cccc(F)c1F
Show InChI InChI=1S/C14H12F2N2O3S/c15-12-3-1-2-10(13(12)16)8-18-14(19)9-4-6-11(7-5-9)22(17,20)21/h1-7H,8H2,(H,18,19)(H2,17,20,21)
n/an/an/a 1.60n/an/an/a7.437
University of Pennsylvania
Assay Description
Inhibitor binding to CA II was determined using a fluorescence competition assay. Displacement of dansylamide and binding of the inhibitor was determ...
J Am Chem Soc 123: 9620-7 (2001)
Article DOI: 10.1021/ja011034p
BindingDB Entry DOI: 10.7270/Q2QZ286J
3D
3D Structure (crystal)