BDBM120323 US8703811, 64
SMILES: Cc1nc2cc(ccc2n1-c1ccc(s1)C(=O)NC1CC1)C(F)(F)F
InChI Key: InChIKey=KQUWFTFWWIPMAD-UHFFFAOYSA-N
Data: 1 IC50
Activity Spreadsheet -- Enzyme Inhibition Constant Data from BindingDB
Found 1 hit for monomerid = 120323
Trg + Lig
Ki
nM
ΔG°
kcal/mole
IC50
nM
Kd
nM
EC50/IC50
nM
koff
s-1
kon
M-1s-1
pHTemp
°C
Dihydroorotate dehydrogenase (quinone), mitochondrial
(Plasmodium falciparum)
BDBM120323
(US8703811, 64)
Show SMILES Cc1nc2cc(ccc2n1-c1ccc(s1)C(=O)NC1CC1)C(F)(F)F
Show InChI InChI=1S/C17H14F3N3OS/c1-9-21-12-8-10(17(18,19)20)2-5-13(12)23(9)15-7-6-14(25-15)16(24)22-11-3-4-11/h2,5-8,11H,3-4H2,1H3,(H,22,24)
US Patent
n/an/a 41n/an/an/an/an/an/a
Genzyme Corporation; Massachusetts Institute of Technology; President and Fellows of Harvard College
US Patent
Assay Description
Type 2 DHODH activity was monitored with either the direct assay measuring the formation of orotate or via a chromogen reduction assay using DCIP. Al...
US Patent US8703811 (2014)
BindingDB Entry DOI: 10.7270/Q2WD3Z7P