BDBM12051 (3S)-3-{[2-(3-methylphenyl)benzene]sulfonamido}-4-oxobutanoic acid::(S)-3-(3-Methyl-biphenyl-2-sulfonylamino)-4-oxo-butyric acid::arylsulfonamide analogue 15
SMILES: Cc1cccc(c1)-c1ccccc1S(=O)(=O)N[C@@H](CC(O)=O)C=O
InChI Key: InChIKey=TUCWJOZUVUUUBG-AWEZNQCLSA-N
Data: 1 KI
Activity Spreadsheet -- Enzyme Inhibition Constant Data from BindingDB
Found 1 hit for monomerid = 12051
Trg + Lig
Ki
nM
ΔG°
kcal/mole
IC50
nM
Kd
nM
EC50/IC50
nM
koff
s-1
kon
M-1s-1
pHTemp
°C
Caspase-1
(Homo sapiens (Human))
BDBM12051
((3S)-3-{[2-(3-methylphenyl)benzene]sulfonamido}-4-...)
Show SMILES Cc1cccc(c1)-c1ccccc1S(=O)(=O)N[C@@H](CC(O)=O)C=O |r|
Show InChI InChI=1S/C17H17NO5S/c1-12-5-4-6-13(9-12)15-7-2-3-8-16(15)24(22,23)18-14(11-19)10-17(20)21/h2-9,11,14,18H,10H2,1H3,(H,20,21)/t14-/m0/s1
NCI pathway
Reactome pathway
3.10E+3 -7.81n/an/an/an/an/a7.037
Pfizer
Assay Description
The substrate peptides terminating in AMC are processed by caspases with or without inhibitors, and the accumulation of AMC was assessed with a Cytof...
Bioorg Med Chem 10: 31-40 (2002)
Article DOI: 10.1016/s0968-0896(01)00250-4
BindingDB Entry DOI: 10.7270/Q2BP011G