BDBM12057 (3S)-3-{[2-(2-methylphenoxy)benzene]sulfonamido}-4-oxobutanoic acid::Diphenyl Ether Sulfonamide 3
SMILES: Cc1ccccc1Oc1ccccc1S(=O)(=O)N[C@@H](CC(O)=O)C=O
InChI Key: InChIKey=NIWORFZHCLVJEB-ZDUSSCGKSA-N
Data: 1 KI
Activity Spreadsheet -- Enzyme Inhibition Constant Data from BindingDB
Found 1 hit for monomerid = 12057
Trg + Lig
Ki
nM
ΔG°
kcal/mole
IC50
nM
Kd
nM
EC50/IC50
nM
koff
s-1
kon
M-1s-1
pHTemp
°C
Caspase-1
(Homo sapiens (Human))
BDBM12057
((3S)-3-{[2-(2-methylphenoxy)benzene]sulfonamido}-4...)
Show SMILES Cc1ccccc1Oc1ccccc1S(=O)(=O)N[C@@H](CC(O)=O)C=O |r|
Show InChI InChI=1S/C17H17NO6S/c1-12-6-2-3-7-14(12)24-15-8-4-5-9-16(15)25(22,23)18-13(11-19)10-17(20)21/h2-9,11,13,18H,10H2,1H3,(H,20,21)/t13-/m0/s1
NCI pathway
Reactome pathway
3.00E+3 -7.83n/an/an/an/an/a7.037
Pfizer
Assay Description
The substrate peptides terminating in AMC are processed by caspases with or without inhibitors, and the accumulation of AMC was assessed with a Cytof...
Bioorg Med Chem Lett 11: 2779-82 (2001)
Article DOI: 10.1016/s0960-894x(01)00573-x
BindingDB Entry DOI: 10.7270/Q26W9896