BDBM12061 (3S)-4-oxo-3-{[2-(3,4,5-trimethylphenoxy)benzene]sulfonamido}butanoic acid::Diphenyl Ether Sulfonamide 7
SMILES: Cc1cc(Oc2ccccc2S(=O)(=O)N[C@@H](CC(O)=O)C=O)cc(C)c1C
InChI Key: InChIKey=OZXOKRAILMZDOL-HNNXBMFYSA-N
Data: 1 KI
Activity Spreadsheet -- Enzyme Inhibition Constant Data from BindingDB
Found 1 hit for monomerid = 12061
Trg + Lig
Ki
nM
ΔG°
kcal/mole
IC50
nM
Kd
nM
EC50/IC50
nM
koff
s-1
kon
M-1s-1
pHTemp
°C
Caspase-1
(Homo sapiens (Human))
BDBM12061
((3S)-4-oxo-3-{[2-(3,4,5-trimethylphenoxy)benzene]s...)
Show SMILES Cc1cc(Oc2ccccc2S(=O)(=O)N[C@@H](CC(O)=O)C=O)cc(C)c1C |r|
Show InChI InChI=1S/C19H21NO6S/c1-12-8-16(9-13(2)14(12)3)26-17-6-4-5-7-18(17)27(24,25)20-15(11-21)10-19(22)23/h4-9,11,15,20H,10H2,1-3H3,(H,22,23)/t15-/m0/s1
NCI pathway
Reactome pathway
450 -9.00n/an/an/an/an/a7.037
Pfizer
Assay Description
The substrate peptides terminating in AMC are processed by caspases with or without inhibitors, and the accumulation of AMC was assessed with a Cytof...
Bioorg Med Chem Lett 11: 2779-82 (2001)
Article DOI: 10.1016/s0960-894x(01)00573-x
BindingDB Entry DOI: 10.7270/Q26W9896