BDBM12067 (3S)-4-oxo-3-({2-[4-(pentan-3-yl)phenoxy]benzene}sulfonamido)butanoic acid::Diphenyl Ether Sulfonamide 13
SMILES: CCC(CC)c1ccc(Oc2ccccc2S(=O)(=O)N[C@@H](CC(O)=O)C=O)cc1
InChI Key: InChIKey=HQQFFNIFBRBRNV-KRWDZBQOSA-N
Data: 1 KI
Activity Spreadsheet -- Enzyme Inhibition Constant Data from BindingDB
Found 1 hit for monomerid = 12067
Trg + Lig
Ki
nM
ΔG°
kcal/mole
IC50
nM
Kd
nM
EC50/IC50
nM
koff
s-1
kon
M-1s-1
pHTemp
°C
Caspase-1
(Homo sapiens (Human))
BDBM12067
((3S)-4-oxo-3-({2-[4-(pentan-3-yl)phenoxy]benzene}s...)
Show SMILES CCC(CC)c1ccc(Oc2ccccc2S(=O)(=O)N[C@@H](CC(O)=O)C=O)cc1 |r|
Show InChI InChI=1S/C21H25NO6S/c1-3-15(4-2)16-9-11-18(12-10-16)28-19-7-5-6-8-20(19)29(26,27)22-17(14-23)13-21(24)25/h5-12,14-15,17,22H,3-4,13H2,1-2H3,(H,24,25)/t17-/m0/s1
NCI pathway
Reactome pathway
440 -9.01n/an/an/an/an/a7.037
Pfizer
Assay Description
The substrate peptides terminating in AMC are processed by caspases with or without inhibitors, and the accumulation of AMC was assessed with a Cytof...
Bioorg Med Chem Lett 11: 2779-82 (2001)
Article DOI: 10.1016/s0960-894x(01)00573-x
BindingDB Entry DOI: 10.7270/Q26W9896